program: Gaussian 09
title: 000102917
version: EM64L-G09RevD.01
frameworkgroup: C1[X(C15H32O4)]
method: RPBEPBE
basis: SDD
operation: Freq
keyword: #pfreq=noraman
keyword: PBEPBE/SDD
title: #p freq=noraman PBEPBE/SDD
converged: YES YES NO NO
title: Mulliken charges:
elementType: O O O O C C C C C C C C C C C C C C C H H H H H H H H H H H H H H H H H H H H H H H H H H H H H H H H
charge: -0.455848 -0.324878 -0.469956 -0.441164 -0.386594 -0.380129 -0.382568 -0.385187 -0.382703 -0.430225 -0.372315 -0.111336 -0.353633 -0.285416 -0.356500 -0.260267 -0.696611 -0.145114 -0.305722 0.193591 0.194414 0.187925 0.195353 0.191456 0.194619 0.211246 0.210663 0.191474 0.193048 0.223702 0.199398 0.188782 0.190210 0.207426 0.187280 0.188246 0.220995 0.223089 0.195116 0.194516 0.343517 0.216901 0.196377 0.209450 0.209920 0.215124 0.239419 0.201534 0.200918 0.356855 0.353604
chargesum: 0.00000
title: Mulliken charges with hydrogens summed into heavy atoms:
elementType: O O O O C C C C C C C C C C C C C C C
charge: -0.112332 -0.324878 -0.113102 -0.087560 0.001412 0.003149 0.003507 0.036722 0.001819 -0.007126 0.006677 0.096089 0.021892 0.158668 0.033133 0.153011 -0.062117 0.094305 0.096730
polarizability: 2.09360370e+02 4.01680771e+00 1.73243397e+02 1.31309330e+00 1.13187398e+00 1.53970279e+02
1716.lowfreq: -7.5420 -0.0014 -0.0010 0.0005 4.5596 7.2160 9.9304 21.3771 26.9082
frequency: 9.7146 21.0546 26.8871 33.7617 39.5616 53.4722 67.9527 69.5945 78.4871 96.3570 106.8549 116.5187 125.1433 135.7369 144.9157 151.0597 159.9095 170.2037 199.2989 209.9231 232.9023 249.6276 261.9192 270.1514 286.1715 342.5665 360.5007 382.5390 409.2924 432.5638 459.8136 473.9577 483.8766 497.5398 582.3994 604.3215 657.9354 718.7917 722.6898 731.5588 748.1609 780.0924 803.3706 825.5790 850.9745 886.4030 888.5686 898.3040 908.2413 945.1816 967.8430 977.6273 988.6613 995.5414 1009.4429 1010.5019 1022.7236 1030.1025 1042.6646 1053.4456 1072.9765 1073.7473 1080.1805 1081.4212 1087.3152 1111.6691 1112.3609 1120.5273 1126.9452 1154.4212 1177.8567 1183.0190 1206.5915 1210.7249 1213.6739 1229.2495 1242.6818 1245.3564 1249.8616 1268.3499 1273.9608 1278.2632 1285.2794 1287.0461 1291.2021 1294.2774 1295.7259 1300.7759 1314.8054 1330.6365 1337.5196 1344.6023 1351.6663 1355.1585 1357.2563 1366.8914 1371.5333 1375.9556 1391.5683 1395.1546 1417.0925 1453.3078 1459.1089 1459.6124 1462.8413 1463.3888 1464.7916 1469.3446 1471.4193 1475.2961 1477.7845 1481.1906 1485.6284 1487.9851 1488.7727 2943.0331 2945.7356 2948.0779 2948.7427 2950.3158 2951.4746 2955.7377 2960.1851 2961.7073 2962.0408 2964.3087 2967.7060 2971.1307 2971.4862 2981.9301 2985.3247 2991.4418 3000.8046 3003.1985 3011.7989 3019.3542 3023.4101 3029.0170 3039.0617 3046.3862 3050.5068 3067.7996 3067.8590 3070.0184 3485.9178 3491.0135 3573.3803
redmass: 5.4579 3.9551 3.1547 2.3330 2.6450 4.2711 3.9172 2.4602 2.1622 3.2705 3.2141 1.8088 2.9912 2.8415 2.5007 2.6485 2.5283 2.4871 3.9754 3.9612 1.1164 3.5517 3.2251 1.1101 3.3198 3.2778 2.7231 3.1878 3.6810 3.1455 3.0721 1.1930 2.9963 2.3985 1.1232 2.8601 3.8458 1.0600 1.0724 1.1006 1.1723 1.2565 3.4157 1.6384 1.7762 2.4154 1.9039 1.4194 2.4668 1.7664 2.1874 1.5566 3.9659 2.9544 3.0559 3.0427 1.1871 2.5710 2.7784 2.8115 2.6790 2.5140 2.6279 2.0573 2.3528 1.6524 1.7192 2.0252 2.4462 1.0912 1.1821 1.8004 1.3771 1.4194 1.2181 1.3373 1.3410 1.4055 1.3581 1.2286 1.3184 1.0217 1.1585 1.0524 1.3382 1.1145 1.1038 1.3334 1.2523 1.3376 1.3626 1.2392 1.5535 1.6791 1.6501 1.4814 1.2316 1.4353 1.2184 1.3127 1.6252 1.1104 1.0747 1.0744 1.0791 1.0706 1.0789 1.0823 1.0903 1.0817 1.0447 1.0854 1.0889 1.0846 1.0872 1.0737 1.0552 1.0593 1.0588 1.0595 1.0594 1.0594 1.0720 1.0594 1.0657 1.0588 1.0586 1.0591 1.0369 1.0962 1.0975 1.0996 1.1017 1.1072 1.1015 1.1011 1.1059 1.1034 1.1041 1.1033 1.0882 1.0957 1.1005 1.0993 1.0647 1.0647 1.0662
irintensity: 0.7267 0.7197 0.0413 0.1173 0.1583 0.2985 2.4746 0.8187 1.1782 0.5143 0.0350 1.7611 10.5547 0.0848 3.2549 5.5196 0.2380 7.5274 1.3134 8.0324 0.0220 6.4811 15.4757 161.9184 5.0261 0.9521 2.5234 0.1278 7.7969 2.5064 0.9407 38.3893 0.7230 4.9762 236.0420 8.0826 5.9940 15.9889 0.1201 6.6170 0.6970 0.9082 40.5279 3.5040 1.0582 7.9803 3.9630 2.6738 11.1058 52.0951 20.2673 49.4929 5.2289 72.3480 4.8334 6.5520 12.0882 55.5065 28.7573 12.9963 55.2206 6.0211 31.9890 0.0990 4.8918 22.0539 5.1770 15.9639 6.6746 60.7639 0.7905 1.9098 15.6876 5.0474 25.4977 16.1040 1.0235 12.5225 3.9457 0.1756 4.3325 0.0845 0.3082 0.5702 7.4934 0.2679 0.2214 2.8602 4.8774 9.6200 1.1309 21.9523 1.3960 0.1808 0.1558 14.6436 64.0148 7.9903 11.2943 6.0365 10.3742 5.2817 0.0415 0.2837 7.8216 3.4069 2.9870 0.6423 2.0861 1.4690 12.2879 2.9824 10.0748 37.9916 3.4775 23.4051 43.0920 0.9283 0.0129 1.4372 1.3334 0.1903 65.9706 40.1656 65.0176 26.8657 121.0466 148.8739 41.8910 0.4545 0.3716 0.5276 0.8806 52.9954 2.7612 2.6817 63.9262 2.6394 68.6630 216.4320 12.5451 50.3287 106.5223 55.7669 24.0574 19.4342 5.2925
temp: 298.150 k
press: 1.00000 atm
elementType: 8 8 8 8 6 6 6 6 6 6 6 6 6 6 6 6 6 6 6 1 1 1 1 1 1 1 1 1 1 1 1 1 1 1 1 1 1 1 1 1 1 1 1 1 1 1 1 1 1 1 1
symmnumber: 1
zpe: 1190383.8 jmol-1
zpe.correction: 0.453393 hartree
zpe.thermalcorrener: 0.478433 hartree
zpe.thermalcorrenthalpy: 0.479377 hartree
zpe.thermalcorrgfe: 0.393591 hartree
zpe.sumelectzpe: -890.043436 hartree
zpe.sumelectthermal: -890.018396 hartree
zpe.sumelectthermalent: -890.017452 hartree
zpe.sumelectthermalfe: -890.103238 hartree
dipole: 1.3369 -3.4956 0.5136
dipole: 3.7776
quadrupole: -133.0705 -134.3357 -116.0890
quadrupole: 12.3154 -5.5476 11.1619
quadrupole: -5.2388 -6.5040 11.7427 12.3154 -5.5476 11.1619
hfenergy: -890.4968292 hartree
pointgroup: C01 [X(C15H32O4)]
dipole: 0.4990436 -1.3879422 0.1828918 debye
polarizability: 209.4493737|3.324361|173.0641259|2.0834958|1.4996228|154.0605465 unknown
InChI: InChI=1S/C15H32O4/c1-2-3-4-5-6-7-8-9-10-14(17)12-19-13-15(18)11-16/h14-18H,2-13H2,1H3
charge 0 multiplicity 1
51 atoms
O  -2.877097 -3.643531 0.201004
O  -3.997417 -0.152966 0.230537
O  -5.769124 1.717479 -0.681129
O  -4.155594 3.984686 -0.747543
C  1.789424 -0.790975 0.132453
C  0.617742 -1.113919 -0.82158
C  3.1149 -0.50007 -0.606765
C  -0.696213 -1.457493 -0.084812
C  4.286132 -0.159207 0.341758
C  -1.864474 -1.724607 -1.059173
C  5.61658 0.103003 -0.399572
C  -3.132169 -2.323175 -0.415242
C  6.787553 0.45576 0.544975
C  -3.704733 -1.496971 0.743843
C  8.119461 0.706918 -0.198469
C  -4.593362 0.731684 1.245862
C  9.28359 1.063659 0.750966
C  -4.950603 2.030122 0.512946
C  -3.721262 2.846219 0.060673
H  1.938698 -1.641212 0.830726
H  1.520205 0.083406 0.761219
H  0.903635 -1.966295 -1.473789
H  0.447782 -0.249988 -1.498178
H  3.389425 -1.380815 -1.224727
H  2.962084 0.340427 -1.3160
H  -0.961634 -0.619494 0.590603
H  -0.539444 -2.34812 0.556425
H  4.427557 -0.990983 1.063679
H  4.020762 0.733611 0.945878
H  -2.15015 -0.782012 -1.565656
H  -1.524657 -2.419238 -1.858198
H  5.885404 -0.793743 -0.996669
H  5.473082 0.928472 -1.128291
H  -3.914809 -2.42017 -1.199718
H  6.928804 -0.36565 1.278814
H  6.523858 1.357468 1.136666
H  -4.630747 -1.977504 1.121676
H  -2.971208 -1.4432 1.573609
H  7.976835 1.525167 -0.933837
H  8.383167 -0.195823 -0.786804
H  -2.499819 -4.244879 -0.489261
H  -5.506956 0.25926 1.664067
H  -3.871906 0.91926 2.069879
H  9.469515 0.247657 1.474985
H  9.055738 1.978516 1.330199
H  10.222196 1.241228 0.194184
H  -5.597515 2.662701 1.145785
H  -3.190791 3.272544 0.930325
H  -3.025512 2.188693 -0.503367
H  -5.379242 0.885344 -1.066105
H  -4.864794 3.631958 -1.35115
