program: Gaussian 09
title: 000102884
version: EM64L-G09RevD.01
frameworkgroup: C1[X(C9H17NO2)]
method: RPBEPBE
basis: SDD
operation: Freq
keyword: #p
keyword: freq=noraman
keyword: PBEPBE/SDD
title: #p freq=noraman PBEPBE/SDD
converged: NO YES NO NO
title: Mulliken charges:
elementType: O O N C C C C C C C C C H H H H H H H H H H H H H H H H H
charge: -0.290813 -0.267586 -0.317251 -0.221251 -0.456090 -0.445143 -0.400649 0.332463 0.240537 -0.708729 -0.700442 -0.707029 0.260549 0.243841 0.227248 0.227365 0.220042 0.213597 0.212135 0.280736 0.218887 0.212101 0.266234 0.229931 0.226843 0.204376 0.265391 0.211084 0.221625
chargesum: 0.00000
title: Mulliken charges with hydrogens summed into heavy atoms:
elementType: O O N C C C C C C C C C
charge: -0.290813 -0.267586 -0.036515 0.039298 0.014998 0.002265 0.025082 0.332463 0.240537 -0.011508 -0.039292 -0.008929
polarizability: 1.30837938e+02 -2.29699607e+00 1.00494861e+02 1.90714569e+00 -2.58562944e+00 9.30432883e+01
1716.lowfreq: -14.4294 -4.0818 -0.0004 -0.0004 0.0004 5.3470 29.6531 40.8291 60.0669
frequency: 28.6809 37.7566 59.9670 106.1948 126.3483 149.3874 172.5001 229.3033 238.0038 242.8385 266.4087 308.1753 318.0588 347.7844 407.4167 437.4044 450.9773 536.1730 573.8596 605.7490 689.0813 725.0281 778.8624 809.4321 833.6041 860.9181 900.1866 914.9458 915.4435 924.2367 948.5900 953.1694 956.2725 1027.4929 1031.9824 1058.3020 1087.2535 1119.1447 1126.7334 1157.7487 1181.2665 1197.8364 1208.3548 1248.5501 1257.3207 1270.5884 1289.0578 1302.7165 1312.8217 1342.7012 1372.3793 1378.1083 1399.9336 1425.7691 1444.9736 1466.0695 1466.7257 1468.7749 1470.9542 1474.8113 1479.4160 1499.5348 1501.4226 1609.1189 2968.1876 2986.2971 2988.5376 2990.1888 2995.0656 2999.9888 3021.5328 3024.0881 3076.8628 3080.1272 3083.6050 3094.6613 3098.4331 3103.2027 3113.8645 3117.4960 3479.2396
redmass: 2.7098 3.0616 3.1098 3.9931 3.6443 2.4615 1.0650 1.8264 1.2455 1.1166 2.7654 3.6540 2.6118 2.5421 2.6848 2.8567 2.6079 2.6280 2.3209 5.2376 3.2954 3.8144 3.4877 3.3437 3.5710 1.8212 1.7852 2.0009 1.7759 1.7604 2.0895 1.2065 2.4550 1.4290 1.4219 1.7244 1.8328 2.9198 1.6477 2.5803 1.8013 2.2415 1.2790 1.3176 3.0091 3.0373 1.3413 1.3281 1.2597 1.3543 1.2298 1.2326 1.2166 1.2720 1.0468 1.0574 1.0513 1.0848 1.0685 1.0950 1.0529 1.0864 1.0563 9.5030 1.0605 1.0822 1.0364 1.0357 1.0366 1.0714 1.0885 1.0725 1.1013 1.0992 1.0991 1.0991 1.1004 1.1028 1.1001 1.0994 1.0750
irintensity: 2.0624 0.1141 5.5239 0.2228 1.4175 1.5106 0.0381 4.3269 1.5409 0.4049 15.5388 28.8623 1.1015 2.8747 0.8044 1.1316 4.7063 91.7792 21.3635 13.3541 17.0498 40.1879 10.9329 17.7710 3.3456 1.5226 19.0124 2.4753 2.6737 3.8708 7.0517 0.1425 6.2831 0.0106 1.0458 41.7465 68.7637 407.0686 56.9133 5.8886 2.9937 5.9386 0.9897 5.5721 25.5684 14.4288 5.3105 2.3765 5.0308 5.9023 42.3377 39.8425 20.5676 22.7499 0.7272 3.9901 5.1798 10.5071 17.0617 11.3075 3.3272 1.1631 26.1482 142.2271 118.5119 17.9260 20.3675 16.1456 27.7805 14.9508 68.0997 7.6609 52.4782 9.5260 12.7798 61.4442 28.9879 29.5127 4.2946 17.8656 5.4772
temp: 298.150 k
press: 1.00000 atm
elementType: 8 8 7 6 6 6 6 6 6 6 6 6 1 1 1 1 1 1 1 1 1 1 1 1 1 1 1 1 1
symmnumber: 1
zpe: 656462.7 jmol-1
zpe.correction: 0.250033 hartree
zpe.thermalcorrener: 0.263855 hartree
zpe.thermalcorrenthalpy: 0.264799 hartree
zpe.thermalcorrgfe: 0.208881 hartree
zpe.sumelectzpe: -557.384707 hartree
zpe.sumelectthermal: -557.370885 hartree
zpe.sumelectthermalent: -557.369941 hartree
zpe.sumelectthermalfe: -557.425860 hartree
dipole: -1.8554 1.6894 0.5694
dipole: 2.5731
quadrupole: -67.9256 -75.4550 -74.6967
quadrupole: 1.9923 2.9158 1.1783
quadrupole: 4.7669 -2.7626 -2.0043 1.9923 2.9158 1.1783
hfenergy: -557.6347404 hartree
pointgroup: C01 [X(C9H17N1O2)]
dipole: -0.7203727 0.64974 0.2893622 debye
polarizability: 130.9475404|-2.3312845|100.6956769|-0.0068163|-2.1096954|92.7328699 unknown
InChI: InChI=1S/C9H17NO2/c1-9(2,3)12-8(11)7-5-4-6-10-7/h7,10H,4-6H2,1-3H3
charge 0 multiplicity 1
29 atoms
O  -0.950679 0.398843 -0.491146
O  0.071405 -1.529714 0.37675
N  2.525935 -0.861169 -0.877135
C  1.367149 0.036276 -1.050922
C  1.871301 1.405012 -0.507592
C  2.776847 0.98887 0.679119
C  3.449296 -0.317273 0.170875
C  -2.333774 0.125376 0.113562
C  0.114186 -0.467659 -0.293423
C  -2.216909 0.09821 1.650163
C  -3.139922 1.341039 -0.372885
C  -2.884737 -1.192286 -0.46526
H  1.072182 0.132207 -2.114306
H  1.040727 2.07188 -0.22815
H  2.47071 1.898825 -1.293459
H  3.512588 1.767433 0.943122
H  2.158723 0.783018 1.572953
H  4.439466 -0.097152 -0.274391
H  3.603012 -1.042966 0.992801
H  2.24892 -1.836726 -0.71533
H  -1.745563 1.026901 2.018363
H  -3.22749 0.027994 2.092782
H  -1.622842 -0.765093 1.988196
H  -3.153647 1.38241 -1.475524
H  -2.69685 2.278583 0.005066
H  -4.181115 1.271849 -0.009669
H  -2.282648 -2.053144 -0.135257
H  -3.925305 -1.335865 -0.120687
H  -2.890464 -1.157482 -1.569117
