program: Gaussian 09
title: 000102873
version: EM64L-G09RevD.01
frameworkgroup: C1[X(C7H17N)]
method: RPBEPBE
basis: SDD
operation: Freq
keyword: #pfreq=noraman
keyword: PBEPBE/SDD
title: #p freq=noraman PBEPBE/SDD
converged: YES YES NO NO
title: Mulliken charges:
elementType: N C C C C C C C H H H H H H H H H H H H H H H H H
charge: -0.330167 0.009284 -0.055346 -0.745170 -0.719144 -0.731854 -0.321417 -0.702451 0.176371 0.188139 0.247515 0.217261 0.206919 0.234226 0.233166 0.199506 0.221303 0.221608 0.202206 0.214573 0.215299 0.173390 0.201050 0.230884 0.212848
chargesum: 0.00000
title: Mulliken charges with hydrogens summed into heavy atoms:
elementType: N C C C C C C C
charge: -0.082652 0.185655 0.132793 -0.086764 -0.065169 -0.093467 0.067272 -0.057668
polarizability: 9.50188384e+01 -3.14163524e-01 8.32776019e+01 1.39628985e-01 -3.55149909e-01 7.53149385e+01
1716.lowfreq: -40.6857 -13.0851 0.0005 0.0007 0.0007 11.2635 60.6241 70.5567 95.9690
frequency: 60.3472 70.2419 95.9226 134.0948 187.6743 216.8698 233.7139 246.4799 263.9232 285.1865 331.7087 365.1065 442.5951 484.7684 558.3073 666.7397 757.1834 811.4353 865.9729 908.8606 911.6252 949.5229 956.5096 1017.5503 1035.7037 1055.9225 1096.6427 1125.8198 1142.0663 1163.3101 1177.0624 1206.4290 1252.3686 1289.6711 1303.8050 1333.4869 1350.6148 1359.9193 1372.7934 1378.0235 1388.1130 1391.7149 1449.5498 1460.7550 1466.5535 1469.7307 1471.7238 1481.5200 1482.7441 1492.3751 1498.0458 1499.4911 2801.2298 2841.6572 2964.5302 2967.2889 2976.1643 2979.3800 2982.5584 3011.2198 3054.8216 3065.1439 3068.8208 3070.2301 3073.9662 3084.5613 3087.1984 3089.5931 3425.1968
redmass: 1.9357 2.0540 2.3357 2.3170 1.1724 1.1729 1.2109 1.1364 1.8451 2.6209 2.4932 2.3382 2.5773 2.3317 2.1657 1.5471 2.3463 1.1073 1.9843 1.7012 1.2438 1.6219 1.4645 1.6411 1.7364 1.8745 2.1129 1.7752 2.2332 2.2695 2.1143 2.0576 1.1525 1.4203 1.2484 1.4001 1.4964 1.3567 1.2294 1.2175 1.2325 1.2406 1.1755 1.0572 1.0478 1.0504 1.0584 1.0468 1.0486 1.0548 1.0698 1.0932 1.0809 1.0723 1.0357 1.0819 1.0372 1.0360 1.0372 1.0855 1.0990 1.0993 1.0978 1.0988 1.0986 1.0996 1.0996 1.1001 1.0731
irintensity: 0.4973 2.5150 0.7011 0.3579 0.3351 0.5102 0.0839 0.7711 0.3898 0.5940 1.6213 0.4846 0.7145 10.7259 18.0723 53.8012 5.8066 3.3928 2.9886 2.6077 2.8323 0.6344 0.5303 5.7946 12.7765 0.4477 22.6774 10.8988 12.5668 32.2096 5.4572 14.1334 13.4154 3.0359 2.6534 0.5010 24.8780 13.5432 17.0254 24.6144 14.6479 24.0149 26.4166 1.8128 1.4970 8.0763 19.1730 4.6973 16.0462 10.3599 19.2340 1.7338 98.2472 135.4930 33.0218 30.9064 34.1734 26.1429 24.5350 28.6518 47.3561 13.5402 42.6047 88.8022 39.9085 58.9858 21.6948 40.1719 2.5620
temp: 298.150 k
press: 1.00000 atm
elementType: 7 6 6 6 6 6 6 6 1 1 1 1 1 1 1 1 1 1 1 1 1 1 1 1 1
symmnumber: 1
zpe: 601493.5 jmol-1
zpe.correction: 0.229097 hartree
zpe.thermalcorrener: 0.240306 hartree
zpe.thermalcorrenthalpy: 0.241250 hartree
zpe.thermalcorrgfe: 0.192807 hartree
zpe.sumelectzpe: -330.985524 hartree
zpe.sumelectthermal: -330.974315 hartree
zpe.sumelectthermalent: -330.973371 hartree
zpe.sumelectthermalfe: -331.021814 hartree
dipole: -0.1076 -0.3430 -0.9786
dipole: 1.0425
quadrupole: -51.4121 -52.3231 -54.9860
quadrupole: 0.1371 0.0504 -0.0238
quadrupole: 1.4950 0.5840 -2.0789 0.1371 0.0504 -0.0238
hfenergy: -331.2146208 hartree
pointgroup: C01 [X(C7H17N1)]
dipole: 0.0292247 0.1484378 -0.3812466 debye
dipolederiv: -0.8340484 -0.0936669 0.0058519 -0.0893133 -0.2773687 -0.089295 0.025084 -0.137035 -0.5623718 0.3972708 0.1178746 0.1049937 0.2536168 0.3168906 0.0713794 0.1156275 0.0663438 0.4212487 0.1214467 -0.0187229 0.0139194 -0.0011844 0.1026286 -0.0007087 0.0052068 -0.0085643 0.1308078 0.0093917 0.0430891 -0.002049 -0.0075147 -0.1548277 0.0242728 -0.0275041 0.0136598 0.0560357 0.021702 0.0073784 0.0488923 0.0213109 0.0329704 0.0291882 0.0315657 0.0232366 -0.0963291 0.0220111 0.0689865 0.0188659 0.0565987 -0.0814596 0.0459973 0.0487209 0.0494465 0.0488759 0.5967717 -0.0302364 -0.1213265 -0.1658208 0.1738186 -0.0359291 -0.13366 -0.0365213 0.4015719 -0.0719646 -0.0641024 -0.0421142 -0.0749526 0.0512072 -0.0345753 -0.0123986 -0.044647 0.0433433 -0.0610375 -0.0148722 0.0359333 -0.0471901 -0.0260519 0.0541857 -0.0762887 -0.0046458 -0.3283835 -0.0743262 -0.0838171 -0.0748346 -0.0950424 -0.0500921 -0.0738713 -0.0820831 -0.0714799 -0.0535661 0.1710234 -0.0214796 -0.0078823 0.0142991 -0.0645398 0.00491 -0.0365125 0.0978559 0.2257133 -0.0943212 0.132712 0.0932706 0.0972573 0.0289792 -0.0184122 0.0982964 -0.0380008 0.0355316 -0.09039 -0.1435738 -0.0838135 -0.089216 0.0246768 -0.0234088 -0.0816098 -0.0441639 0.0563981 0.1046899 0.0042534 -0.0136323 0.0024811 0.0730167 0.0116288 -0.0065982 0.0757968 -0.1294814 0.0240706 -0.0818517 -0.1245118 -0.076351 0.0338901 -0.0658834 -0.0776799 -0.0342972 0.0195864 -0.1621102 0.0950959 0.0900135 0.123443 0.0422887 -0.0435339 0.0529679 -0.0197624 0.0529789 0.1085423 0.0024045 -0.0123595 -0.0305191 -0.1606502 0.1000594 -0.0123394 0.0714182 0.0415764 -0.1782447 0.115361 0.0088977 0.0666829 0.0379101 0.0002141 0.0293155 -0.0079405 0.0934808 0.0029037 -0.1167451 -0.0884318 -0.0837324 -0.0222665 -0.0511596 -0.0993168 -0.1000774 -0.0039189 0.0839927 -0.029993 0.0907995 -0.0193514 0.0572781 0.0222415 0.0614038 0.0699713 -0.1684629 0.008814 0.0291654 -0.0004801 0.0881067 -0.1638308 0.0408803 0.005978 0.0596325 0.0358242 -0.0980054 -0.0158719 0.0015339 0.0088331 0.0386956 -0.007627 0.1603805 -0.0227386 -0.3021863 0.0727994 0.0807387 -0.0278349 0.0096074 -0.167711 0.0528044 -0.0362472 0.0775582 0.0560322 0.1130266 -0.0001901 0.0450012 -0.0137062 0.0779648 0.0110726 -0.0233618 -0.0159419 -0.1589084 -0.1940085 0.0180636 0.0412978 0.0516577 0.0765825 -0.0244302 0.0710531 -0.0191036 0.0846031 unknown
polarizability: 95.0111982|0.2341612|83.2445623|-0.5074802|0.5866687|75.3556182 unknown
InChI: InChI=1S/C7H17N/c1-5-8-7(4)6(2)3/h6-8H,5H2,1-4H3
charge 0 multiplicity 1
25 atoms
N  0.779787 0.226046 0.147584
C  -0.288903 -0.526346 -0.559828
C  -1.696674 0.024827 -0.163483
C  -0.161445 -2.040644 -0.280177
C  -2.010619 -0.143891 1.342236
C  -1.878838 1.500665 -0.601997
C  2.170448 -0.075664 -0.260979
C  3.152827 0.907845 0.399087
H  -0.201173 -0.387502 -1.672467
H  -2.426093 -0.581359 -0.741593
H  0.608692 1.24017 0.087918
H  0.736282 -2.469489 -0.760486
H  -1.041361 -2.579983 -0.677246
H  -0.089167 -2.22833 0.805372
H  -1.234473 0.3492 1.954068
H  -2.991861 0.304144 1.587783
H  -2.04369 -1.208473 1.635012
H  -2.937001 1.806557 -0.506889
H  -1.288808 2.193832 0.028865
H  -1.57582 1.648754 -1.656521
H  2.420945 -1.105075 0.057292
H  2.30258 -0.044254 -1.373949
H  2.952019 1.949259 0.079847
H  3.058649 0.863196 1.498633
H  4.195698 0.667715 0.124419
