program: Gaussian 09
title: 000102871
version: EM64L-G09RevD.01
frameworkgroup: C1[X(C5H8FNO4)]
method: RPBEPBE
basis: SDD
operation: Freq
keyword: #p
keyword: freq=noraman
keyword: PBEPBE/SDD
title: #p freq=noraman PBEPBE/SDD
converged: YES YES NO NO
title: Mulliken charges:
elementType: F O O O O N C C C C C H H H H H H H H
charge: -0.208560 -0.410514 -0.430634 -0.236328 -0.194605 -0.651512 -0.422525 -0.191070 0.011076 0.182388 0.128244 0.259915 0.244828 0.268338 0.260822 0.326197 0.286789 0.388756 0.388392
chargesum: 0.00000
title: Mulliken charges with hydrogens summed into heavy atoms:
elementType: F O O O O N C C C C C
charge: -0.208560 -0.021757 -0.042242 -0.236328 -0.194605 -0.038525 0.082219 0.077268 0.271898 0.182388 0.128244
polarizability: 8.64821603e+01 -1.10952356e-01 7.64327681e+01 -6.35960339e+00 -6.16394963e-01 6.09853832e+01
1716.lowfreq: -6.2374 -0.0007 0.0002 0.0005 6.3645 11.6275 39.9656 46.6677 78.0685
frequency: 39.9492 46.6364 78.0481 82.7043 152.8048 172.9663 243.7984 259.2588 281.7253 311.7273 378.3205 424.6133 462.4048 508.6846 549.8367 556.3110 591.8713 600.8878 636.3527 672.6165 714.6815 766.6458 872.6138 913.9695 941.0858 990.7847 1052.3307 1057.4189 1086.0587 1120.2185 1182.0165 1204.9114 1222.4817 1253.9894 1281.1481 1292.1502 1341.2293 1361.2824 1381.8246 1442.7241 1610.2216 1669.4722 1687.1203 2937.7355 3012.3300 3025.7634 3094.1712 3482.3121 3523.4750 3529.9520 3629.7359
redmass: 8.3266 8.7133 8.6842 7.5436 5.2099 6.1151 1.3707 2.9528 6.1409 4.4257 2.8681 4.5142 3.4917 2.6021 2.6612 2.2091 1.4486 1.7364 1.8318 3.7899 4.3620 3.1092 3.6836 3.3591 3.6973 2.7476 2.6485 2.1874 2.5778 1.7176 1.4487 1.4216 1.4282 1.4689 1.7033 1.4426 1.5061 1.4499 1.8648 1.0993 1.3280 3.7693 9.5208 1.0821 1.0829 1.0599 1.1033 1.0474 1.0643 1.0643 1.0978
irintensity: 0.5008 1.1740 0.5618 2.2062 0.5638 0.5822 20.6599 6.7455 3.6416 0.9137 9.5930 8.9556 30.1642 26.2495 19.6093 187.2107 83.5228 34.3626 237.9370 24.8465 33.7495 13.0099 18.4484 5.8082 23.2416 222.7578 222.1079 97.3127 51.0440 2.8087 29.9224 6.4881 20.0692 3.9391 20.2539 19.5194 12.6362 2.4097 10.1583 16.0905 185.0323 135.3186 261.4157 35.0782 37.4425 8.9497 6.6242 23.1812 32.2826 35.3389 22.8877
temp: 298.150 k
press: 1.00000 atm
elementType: 9 8 8 8 8 7 6 6 6 6 6 1 1 1 1 1 1 1 1
symmnumber: 1
zpe: 363266.2 jmol-1
zpe.correction: 0.138361 hartree
zpe.thermalcorrener: 0.150178 hartree
zpe.thermalcorrenthalpy: 0.151122 hartree
zpe.thermalcorrgfe: 0.099466 hartree
zpe.sumelectzpe: -649.958598 hartree
zpe.sumelectthermal: -649.946781 hartree
zpe.sumelectthermalent: -649.945837 hartree
zpe.sumelectthermalfe: -649.997493 hartree
dipole: 0.5476 3.5755 2.6931
dipole: 4.5097
quadrupole: -59.0832 -60.1270 -64.7570
quadrupole: -7.2074 2.0622 -1.8606
quadrupole: 2.2392 1.1954 -3.4346 -7.2074 2.0622 -1.8606
hfenergy: -650.0969588 hartree
pointgroup: C01 [X(C5H8F1N1O4)]
dipole: -0.2193638 -1.4108487 1.0532433 debye
dipolederiv: -0.4005052 0.1043066 -0.0299934 0.1246184 -0.505534 0.1888302 0.0002678 0.1280485 -0.3353638 -0.4110134 0.0132069 0.1062946 0.0294885 -0.7806784 -0.5086814 0.0973461 -0.4406092 -0.7346182 -0.5700122 0.4195521 -0.0634124 0.4216639 -0.974066 0.1326111 -0.0709289 0.1503033 -0.4399607 -0.6112545 0.0250122 -0.3211429 0.2227773 -0.5280338 0.0311874 -0.2826772 -0.1767473 -0.7890235 -0.7880141 -0.3506062 0.0407126 -0.1745585 -0.8688655 0.1020486 -0.0501171 0.0456509 -0.2968568 -0.7639138 -0.0441856 0.1537806 -0.1587774 -0.4817717 -0.21454 0.0340743 -0.1928407 -0.5233694 -0.0241481 -0.1136434 -0.0216377 0.0820167 -0.0291486 0.0074911 -0.0789925 0.0096497 -0.0430086 0.2146493 0.3018467 -0.0166056 0.2537009 0.2303041 0.2172724 -0.0660779 0.3136344 0.3162076 -0.0228523 -0.1975265 0.0200319 -0.3991612 0.4838796 -0.131389 -0.0418279 -0.1538697 0.4192642 0.7352611 -0.2142184 0.3538917 -0.4586645 1.0135518 0.3337531 0.3749776 0.40702 1.1555709 1.3853946 0.0888337 0.0629986 -0.060612 1.4668331 -0.2215691 0.197286 -0.2035028 0.216798 0.0728498 -0.0466086 0.0214579 -0.0396198 0.0105103 -0.1017482 0.0151255 -0.0689765 0.0043577 0.0225287 0.0596095 -0.0275044 0.0615569 -0.0195183 0.0723874 -0.0339775 0.0613568 0.0745699 -0.0301677 -0.0339771 0.0737457 -0.0162807 0.0280908 0.0279092 0.0972177 -0.0068578 -0.1197336 0.1874735 0.0637775 -0.0450399 0.1728306 0.0572812 -0.0414859 0.0475084 -0.0234197 0.0115999 0.2418862 -0.0421188 -0.127447 -0.0077623 0.2414042 0.0262169 -0.0478185 -0.0103018 0.2408241 0.3106233 -0.0488713 -0.0649759 0.0075441 0.0955186 0.02532 -0.0412846 0.0601922 0.1762156 0.2979162 0.0863571 -0.0900676 0.0747363 0.2698924 0.0505267 -0.1292626 0.0942467 0.2800632 0.1532984 -0.0707461 -0.0250867 -0.1354973 0.2903503 0.0038596 -0.0208385 0.0070229 0.3864634 unknown
polarizability: 86.7847882|-0.3733353|76.433074|5.7008342|0.620872|60.6824495 unknown
InChI: InChI=1S/C5H8FNO4/c6-2(4(8)9)1-3(7)5(10)11/h2-3,8,10H,1,7H2
charge 0 multiplicity 1
19 atoms
F  0.376012 1.17769 -0.807538
O  -2.131668 1.250528 1.18227
O  2.967669 -1.18263 0.183824
O  -2.853941 0.393937 -0.853567
O  3.078096 1.11652 -0.186124
N  -1.383553 -1.909976 -0.533673
C  0.149105 -0.536938 0.908847
C  -1.32198 -0.941919 0.560728
C  0.910072 -0.09762 -0.345195
C  -2.169971 0.279261 0.186082
C  2.407369 0.071767 -0.119178
H  0.150597 0.264829 1.667755
H  0.660478 -1.423317 1.325232
H  -1.763637 -1.328646 1.506395
H  0.720179 -0.844103 -1.142487
H  -2.03671 -1.655965 -1.28105
H  -1.397702 -2.893708 -0.265364
H  -2.656104 2.045551 0.895507
H  3.948288 -1.08146 0.320236
