program: Gaussian 09
title: 000102887
version: EM64L-G09RevD.01
frameworkgroup: C1[X(C12H18O6)]
method: RPBEPBE
basis: SDD
operation: Freq
keyword: #pfreq=noraman
keyword: PBEPBE/SDD
title: #p freq=noraman PBEPBE/SDD
converged: YES YES NO NO
title: Mulliken charges:
elementType: O O O O O O C C C C C C C C C C C C H H H H H H H H H H H H H H H H H H
charge: -0.282920 -0.229336 -0.279582 -0.291504 -0.262923 -0.424265 -0.254745 -0.111159 -0.213404 0.336256 0.308095 0.065102 0.350214 -0.366217 -0.689840 -0.667109 -0.683323 -0.699198 0.264760 0.254110 0.264133 0.230772 0.232529 0.242213 0.224115 0.221043 0.222769 0.276937 0.213988 0.260331 0.217316 0.216128 0.242881 0.218188 0.216977 0.376669
chargesum: 0.00000
title: Mulliken charges with hydrogens summed into heavy atoms:
elementType: O O O O O O C C C C C C C C C C C C
charge: -0.282920 -0.229336 -0.279582 -0.291504 -0.262923 -0.047596 0.010015 0.142950 0.050728 0.336256 0.308095 0.065102 0.350214 0.097084 -0.002469 0.046585 0.010454 -0.021151
polarizability: 1.74902421e+02 4.98211953e+00 1.43640801e+02 -4.04326656e+00 3.93420124e-01 1.23363867e+02
1716.lowfreq: -16.8768 -6.2872 -5.5931 -0.0007 -0.0003 -0.0001 27.8068 37.6044 54.7114
frequency: 27.5676 37.5913 54.6262 68.2543 113.0945 123.4332 145.2963 153.4376 163.8554 186.7950 194.8266 210.8016 215.9922 240.4962 283.0748 312.0906 327.2082 333.3491 338.4045 377.7016 380.1535 403.4057 412.7004 479.7103 503.7096 520.1503 560.0212 597.6783 607.3056 634.5370 664.6856 667.9586 701.3607 723.8455 736.0420 745.7518 748.0170 820.6216 837.4767 888.9881 892.7700 921.5918 923.6233 931.9092 938.6080 954.4286 971.0036 981.1122 988.7221 990.4709 994.2492 1025.4433 1074.8817 1133.6587 1137.5431 1181.3279 1188.7631 1195.4906 1201.5475 1205.6951 1207.3499 1244.7424 1265.1262 1267.9133 1273.2583 1277.0243 1306.5894 1322.8279 1335.2676 1365.5718 1376.9443 1385.0608 1389.6667 1396.9596 1448.3041 1451.9297 1453.0492 1455.0400 1467.5531 1471.8996 1473.0115 1476.4098 1487.3393 1720.8650 2994.4000 2999.6318 3006.4297 3009.0606 3011.0238 3045.6002 3054.8427 3093.3184 3095.8225 3103.3743 3106.7053 3108.5246 3110.6050 3115.0068 3116.7645 3120.8003 3122.6434 3542.2618
redmass: 4.4051 3.6227 4.0784 5.5049 4.1387 4.7818 1.0634 1.0348 3.4026 2.7013 1.7363 1.4543 1.3179 3.8081 3.8588 4.0719 1.3740 1.7288 2.6324 3.0789 2.9456 5.3261 3.7848 3.7761 4.7815 5.9012 6.5754 4.8415 4.4197 5.1381 6.1326 6.1689 5.1106 5.7452 8.0908 3.5967 4.7369 5.4337 4.8201 3.4453 4.2476 1.6173 2.0244 2.1369 2.1201 2.4055 3.7577 2.0692 1.3657 1.7344 5.2733 4.7262 2.3774 1.9159 1.8670 1.6237 2.2511 1.4755 2.1179 2.0778 2.3071 1.8131 3.1009 2.5912 1.3181 1.2129 1.2572 1.2201 2.0112 1.8953 1.2861 1.2871 1.2392 1.2137 1.0533 1.0497 1.0481 1.0483 1.0622 1.0589 1.0641 1.0494 1.0711 8.2694 1.0354 1.0361 1.0355 1.0357 1.0633 1.0863 1.0872 1.0997 1.0995 1.1021 1.1015 1.0998 1.0994 1.0983 1.0921 1.1007 1.1010 1.0660
irintensity: 0.2637 0.0837 2.5524 0.2410 1.7458 0.6233 0.0811 0.0103 2.9190 2.9846 7.7144 2.6388 0.1910 1.9761 8.1218 9.5003 117.4568 77.4637 2.5468 1.4441 3.9952 4.2121 9.1620 14.2377 12.0226 1.7216 10.8583 3.6937 2.7795 3.8746 20.2268 5.7326 14.8361 12.9167 4.9516 56.8192 36.6232 66.0793 61.3130 45.8872 166.6172 6.1309 6.0499 20.9938 6.4366 11.1752 14.0024 102.1822 14.0888 81.2482 36.3438 85.4261 23.3204 34.7236 60.2145 16.7187 115.0663 119.4872 82.7381 64.4888 35.1529 30.2185 28.8052 53.8991 9.7854 13.9147 3.7230 4.5783 17.3705 4.8048 38.7297 41.7666 28.8717 22.9519 3.1499 6.3900 1.4680 0.9165 3.0709 21.9743 8.1894 10.2071 3.8475 5.5941 13.2010 10.8332 20.0311 15.4807 31.5874 8.8036 20.8678 12.1573 5.8408 23.4275 9.1643 32.8048 20.0776 10.8570 17.3751 20.0710 17.8936 37.3552
temp: 298.150 k
press: 1.00000 atm
elementType: 8 8 8 8 8 8 6 6 6 6 6 6 6 6 6 6 6 6 1 1 1 1 1 1 1 1 1 1 1 1 1 1 1 1 1 1
symmnumber: 1
zpe: 756347.2 jmol-1
zpe.correction: 0.288077 hartree
zpe.thermalcorrener: 0.306721 hartree
zpe.thermalcorrenthalpy: 0.307665 hartree
zpe.thermalcorrgfe: 0.241411 hartree
zpe.sumelectzpe: -917.953642 hartree
zpe.sumelectthermal: -917.934999 hartree
zpe.sumelectthermalent: -917.934055 hartree
zpe.sumelectthermalfe: -918.000309 hartree
dipole: 2.5737 0.0805 -0.1705
dipole: 2.5806
quadrupole: -107.6520 -102.2992 -104.7814
quadrupole: 3.1470 -1.2198 4.9146
quadrupole: -2.7411 2.6117 0.1295 3.1470 -1.2198 4.9146
hfenergy: -918.2417197 hartree
pointgroup: C01 [X(C12H18O6)]
dipole: -1.0133928 0.0573954 0.0229955 debye
polarizability: 174.899501|-5.918279|143.0967072|-1.2989374|-3.9365533|123.9108805 unknown
InChI: InChI=1S/C12H18O6/c1-11(2)14-5-6(16-11)8-7(13)9-10(15-8)18-12(3,4)17-9/h6,9-10,13H,5H2,1-4H3
charge 0 multiplicity 1
36 atoms
O  -3.102685 0.60542 0.255804
O  -2.247948 -1.138648 -1.07256
O  -0.108427 0.034853 -1.353395
O  1.919429 0.019579 0.99598
O  3.741371 0.22927 -0.468409
O  -0.924808 2.873028 0.826511
C  -2.149884 1.22928 -0.705596
C  -1.597089 0.041219 -1.562336
C  1.600823 1.158714 0.076155
C  -2.826409 -0.859941 0.286145
C  0.190354 1.059165 -0.401807
C  -0.910386 1.774007 -0.040209
C  3.061846 -0.748907 0.40894
C  2.676254 1.060667 -1.050418
C  -4.164471 -1.585346 0.369476
C  -1.832535 -1.242068 1.390601
C  2.531253 -1.951263 -0.387396
C  4.02193 -1.114051 1.536356
H  -2.73649 1.975263 -1.266561
H  -1.743049 0.07924 -2.650143
H  1.701146 2.082629 0.671122
H  2.256409 0.595117 -1.961054
H  3.126227 2.03482 -1.294532
H  -4.815976 -1.270118 -0.460691
H  -4.00752 -2.67558 0.311618
H  -4.661014 -1.349994 1.326046
H  -1.654674 -2.331057 1.361326
H  -0.863659 -0.731085 1.276438
H  -2.259026 -0.982243 2.375372
H  1.800499 -1.632383 -1.148716
H  2.021149 -2.652962 0.295553
H  3.369109 -2.477144 -0.877576
H  4.365684 -0.198292 2.042658
H  4.895782 -1.651931 1.13046
H  3.514367 -1.762702 2.269964
H  -1.740782 2.841045 1.388674
