program: Gaussian 09
title: 000102874
version: EM64L-G09RevD.01
frameworkgroup: C1[X(C12H10O6)]
method: RPBEPBE
basis: SDD
operation: Freq
keyword: #pfreq=noraman
keyword: PBEPBE/SDD
title: #p freq=noraman PBEPBE/SDD
converged: NO YES NO NO
title: Mulliken charges:
elementType: O O O O O O C C C C C C C C C C C C H H H H H H H H H H
charge: -0.191949 -0.218327 -0.149127 -0.139062 -0.130092 -0.127353 -0.162650 -0.180235 -0.322296 -0.293155 -0.234783 -0.240706 -0.504994 -0.540683 0.164885 0.146261 0.164237 0.167220 0.281383 0.288302 0.309819 0.311232 0.285571 0.294277 0.245808 0.260977 0.267770 0.247672
chargesum: 0.00000
title: Mulliken charges with hydrogens summed into heavy atoms:
elementType: O O O O O O C C C C C C C C C C C C
charge: -0.191949 -0.218327 -0.149127 -0.139062 -0.130092 -0.127353 0.118734 0.108066 -0.012477 0.018077 0.050788 0.053571 0.001791 -0.025242 0.164885 0.146261 0.164237 0.167220
polarizability: 1.41576893e+02 -1.94559186e+00 1.53701090e+02 -2.93913017e+00 2.20284674e-01 9.43760754e+01
1716.lowfreq: -14.0721 0.0005 0.0008 0.0009 5.9131 12.2783 53.1797 84.4227 103.5366
frequency: 53.1668 84.4177 103.5235 132.5794 138.6634 157.6418 184.7433 218.5495 254.6858 282.3494 333.1914 380.1099 412.4556 420.7478 472.5789 497.9168 504.1356 548.7558 573.6822 595.2881 616.8797 638.6705 653.5661 673.7438 680.0465 697.1336 737.0589 776.0778 802.4145 819.2499 831.2949 841.4303 861.6231 867.6845 901.3449 931.6882 978.8208 1031.3040 1035.1285 1048.0777 1052.3480 1076.7182 1083.3028 1111.9011 1123.2022 1139.1447 1161.7037 1186.1435 1208.0371 1217.2544 1227.4783 1235.9910 1269.0848 1272.1397 1280.7885 1293.4430 1305.3304 1320.6026 1327.3705 1337.4889 1374.7859 1391.9327 1487.2464 1500.5520 1700.5020 1736.8881 1768.3731 1790.5066 2932.8990 2952.0745 3001.7804 3007.2473 3016.6564 3039.5094 3057.9160 3064.6954 3070.9994 3079.0978
redmass: 12.2351 8.3129 7.1561 13.6853 11.6764 7.8715 6.6083 8.4875 4.6804 2.2385 7.7420 6.0221 5.7308 5.5072 5.5187 6.3299 5.1196 5.9553 11.8155 8.3481 6.3398 5.7991 4.8422 6.5400 6.0639 8.3742 9.7675 5.3354 2.6737 9.1612 3.3829 2.0171 3.4501 3.3215 3.4111 3.8145 4.1333 2.4492 2.6609 2.8499 2.7572 1.7188 3.2299 2.6595 1.5918 1.6015 2.3076 1.7919 1.4650 1.3956 1.4634 1.3111 1.3675 1.4834 1.5505 1.4826 1.4481 1.7181 1.4073 1.4061 1.2875 1.3470 1.0720 1.0857 12.9406 12.5498 12.8161 12.5755 1.0794 1.0812 1.0834 1.0611 1.0650 1.0853 1.1007 1.0880 1.0895 1.1021
irintensity: 1.0039 4.0826 12.0314 3.0582 5.8444 3.8391 0.7999 0.6896 2.1108 1.0702 13.3020 2.9143 0.2145 1.5110 0.2871 1.7623 7.2979 10.4794 2.4911 3.8917 3.4298 6.4716 15.7585 6.4680 47.4516 91.7636 218.0961 4.8001 7.3909 254.2449 3.4669 15.9374 37.3524 3.5593 14.9082 15.3209 4.5140 29.7556 37.5039 45.8967 73.5786 11.3004 45.5904 86.0778 51.9194 15.9174 9.4666 21.6080 7.1178 1.2897 1.7695 1.3826 4.2074 21.1093 0.5377 3.6797 12.7477 0.5377 1.8944 5.3070 7.5981 4.2936 10.1922 22.7476 397.3366 544.7769 147.1398 89.8992 8.3458 7.8547 4.9199 17.0658 20.6512 5.7149 5.1342 11.3622 3.2178 30.1477
temp: 298.150 k
press: 1.00000 atm
elementType: 8 8 8 8 8 8 6 6 6 6 6 6 6 6 6 6 6 6 1 1 1 1 1 1 1 1 1 1
symmnumber: 1
zpe: 538173.3 jmol-1
zpe.correction: 0.204979 hartree
zpe.thermalcorrener: 0.218645 hartree
zpe.thermalcorrenthalpy: 0.219589 hartree
zpe.thermalcorrgfe: 0.164581 hartree
zpe.sumelectzpe: -913.310038 hartree
zpe.sumelectthermal: -913.296373 hartree
zpe.sumelectthermalent: -913.295429 hartree
zpe.sumelectthermalfe: -913.350437 hartree
dipole: -0.1027 -0.9298 0.9085
dipole: 1.3040
quadrupole: -146.5597 -123.0869 -91.7892
quadrupole: 0.2757 3.7712 0.8407
quadrupole: -26.0811 -2.6083 28.6894 0.2757 3.7712 0.8407
hfenergy: -913.5150176 hartree
pointgroup: C01 [X(C12H10O6)]
dipole: -0.0367155 0.3614759 -0.3622087 debye
polarizability: 141.4990439|1.9703708|153.7029601|3.4546743|-0.4613873|94.4520543 unknown
InChI: InChI=1S/C12H10O6/c13-9-5-3-1-2-4(7(5)11(15)17-9)8-6(3)10(14)18-12(8)16/h3-8H,1-2H2
charge 0 multiplicity 1
28 atoms
O  -3.303158 -0.12954 0.232726
O  3.464002 -0.216333 0.399689
O  -3.042408 2.192437 0.303939
O  -2.893317 -2.429737 0.195931
O  3.333237 2.14435 0.295899
O  2.827628 -2.495907 0.339748
C  0.007803 1.457932 -0.033675
C  -0.121895 -1.128116 -0.723253
C  -1.093183 0.703294 0.788099
C  -0.997816 -0.838857 0.544872
C  1.27581 0.662479 0.364931
C  1.324768 -0.631493 -0.497319
C  -0.298683 1.294426 -1.550297
C  -0.636747 -0.208241 -1.879191
C  -2.530263 1.079009 0.424437
C  -2.442599 -1.291417 0.323283
C  2.738511 1.070852 0.323305
C  2.526229 -1.326636 0.11797
H  0.057988 2.52029 0.256467
H  -0.177776 -2.197335 -0.987759
H  -0.968143 0.944418 1.861734
H  -0.598496 -1.395529 1.410874
H  1.151654 0.350602 1.426287
H  1.70622 -0.339422 -1.50045
H  0.566746 1.647337 -2.140397
H  -1.144828 1.947582 -1.824399
H  -1.722883 -0.346423 -2.027579
H  -0.1566 -0.508521 -2.827473
