program: Gaussian 09
title: 000102891
version: EM64L-G09RevD.01
frameworkgroup: C1[X(C12H16O7)]
method: RPBEPBE
basis: SDD
operation: Freq
keyword: #pfreq=noraman
keyword: PBEPBE/SDD
title: #p freq=noraman PBEPBE/SDD
converged: YES YES NO NO
title: Mulliken charges:
elementType: O O O O O O O C C C C C C C C C C C C H H H H H H H H H H H H H H H H
charge: -0.237229 -0.271721 -0.275743 -0.270307 -0.263494 -0.249234 -0.262121 -0.149022 -0.065353 -0.076695 -0.359079 -0.208758 -0.132672 0.320439 0.318692 0.327856 -0.767725 -0.756554 -0.759641 0.302203 0.262908 0.279099 0.240739 0.274037 0.249247 0.238257 0.242604 0.284316 0.248981 0.248555 0.249039 0.247754 0.246463 0.280637 0.243524
chargesum: 0.00000
title: Mulliken charges with hydrogens summed into heavy atoms:
elementType: O O O O O O O C C C C C C C C C C C C
charge: -0.237229 -0.271721 -0.275743 -0.270307 -0.263494 -0.249234 -0.262121 0.153181 0.197555 0.202404 0.155697 0.040489 0.105585 0.320439 0.318692 0.327856 0.008176 -0.011207 0.010982
polarizability: 1.71064066e+02 7.61998421e-01 1.47012290e+02 3.84139018e+00 -6.33117390e-01 1.30201769e+02
1716.lowfreq: -7.0630 -0.0006 -0.0004 -0.0002 5.3039 7.4966 34.2223 38.4787 41.0646
frequency: 34.2028 38.4680 41.0521 52.8097 55.9344 66.0486 81.1478 83.1797 97.7746 105.0630 107.2832 118.7170 137.1387 170.3603 187.2456 212.6596 256.9931 278.5263 288.1425 309.5768 330.0844 379.5161 455.5970 456.6771 486.0946 523.2134 558.6116 560.8827 567.1188 585.5412 607.5004 615.5123 628.8428 658.5796 758.3050 776.5873 795.9263 813.1289 862.3169 866.8599 896.0818 917.9031 932.6123 942.7763 964.0861 985.1954 990.3859 1002.9525 1007.9935 1041.5510 1046.2995 1047.4584 1050.4503 1070.9431 1123.7265 1149.3555 1179.9324 1188.5358 1203.3135 1213.6094 1233.8024 1267.8355 1277.1806 1304.9353 1319.7628 1332.2275 1350.7465 1358.7336 1379.6703 1382.1305 1383.1660 1384.2304 1452.9012 1453.0261 1454.7415 1455.3114 1456.2630 1457.6753 1471.1733 1638.3300 1647.5756 1651.3797 1654.3356 3003.9908 3004.4281 3006.2973 3006.6329 3044.6772 3056.5773 3060.8313 3097.6434 3100.9733 3101.5638 3119.8175 3141.7116 3141.9567 3142.5047 3171.2547 3198.6093
redmass: 5.9422 1.3935 4.4646 3.0329 7.1698 3.4570 13.4376 3.4315 2.5465 1.8737 1.8946 1.0320 4.2003 7.2486 7.6846 7.0253 4.1363 4.6160 3.1763 4.8574 4.4716 3.2763 3.8918 3.7601 4.3045 4.0192 3.4120 3.3288 3.3905 5.3496 4.2314 5.3186 4.8486 4.5458 1.7082 4.2473 4.4235 3.4464 5.6313 4.7461 5.4564 3.3069 1.4187 3.7433 4.8413 2.6030 1.9032 2.2291 2.0751 1.6576 1.8524 1.6396 2.1568 2.0666 1.7429 2.0921 3.0059 2.7866 2.3391 1.4979 1.4759 1.2777 1.4043 1.4737 1.2447 1.3968 1.4709 1.6958 1.6040 1.2575 1.2376 1.2402 1.0578 1.0596 1.0569 1.0507 1.0568 1.0552 1.0842 6.6300 9.7973 9.9085 9.4470 1.0387 1.0386 1.0844 1.0375 1.0565 1.0850 1.0852 1.0960 1.0934 1.0933 1.1087 1.1027 1.1015 1.1028 1.0876 1.1006
irintensity: 0.4501 2.2365 0.1254 0.5563 4.0034 2.2199 0.0155 8.0238 3.2593 0.8272 0.7581 0.5935 3.3454 0.8526 4.4102 8.1566 1.7286 9.3319 8.5894 10.0648 11.6111 0.4910 9.0511 15.0122 13.2743 12.5466 4.4960 7.6238 5.8410 7.8809 1.0083 3.2330 8.4229 3.3492 20.4843 9.0505 25.6145 22.6932 42.0909 42.8117 177.4550 20.5065 8.9375 69.0936 22.9738 89.1399 30.2830 7.8781 97.2789 8.6210 35.4117 23.0676 68.6119 13.4489 15.9894 8.8986 20.0777 673.6637 189.2729 151.8394 52.0531 17.4395 11.5173 0.6912 7.4224 7.5249 4.4935 1.4627 29.4266 61.1674 48.6621 71.6755 36.5553 16.3293 4.3950 21.2987 25.6768 8.6715 18.2762 142.7561 179.9323 125.6882 172.4619 2.1412 0.3038 11.3773 2.8354 18.9426 17.0540 2.7518 7.3492 9.3403 3.9317 8.9306 7.0910 9.8728 7.1462 3.4929 11.3867
temp: 298.150 k
press: 1.00000 atm
elementType: 8 8 8 8 8 8 8 6 6 6 6 6 6 6 6 6 6 6 6 1 1 1 1 1 1 1 1 1 1 1 1 1 1 1 1
symmnumber: 1
zpe: 706580.2 jmol-1
zpe.correction: 0.269122 hartree
zpe.thermalcorrener: 0.289826 hartree
zpe.thermalcorrenthalpy: 0.290771 hartree
zpe.thermalcorrgfe: 0.217240 hartree
zpe.sumelectzpe: -991.977888 hartree
zpe.sumelectthermal: -991.957183 hartree
zpe.sumelectthermalent: -991.956239 hartree
zpe.sumelectthermalfe: -992.029770 hartree
dipole: -0.1456 -0.4702 -1.9686
dipole: 2.0292
quadrupole: -115.6524 -105.2814 -107.6454
quadrupole: -1.7204 8.2926 6.3384
quadrupole: -6.1260 4.2450 1.8810 -1.7204 8.2926 6.3384
hfenergy: -992.2470098 hartree
pointgroup: C01 [X(C12H16O7)]
dipole: -0.2216232 0.7665993 -0.0243342 debye
polarizability: 163.6552755|16.0202063|138.3874568|-2.1906273|2.9736405|146.2353936 unknown
InChI: InChI=1S/C12H16O7/c1-7(13)17-6-11-12(19-9(3)15)10(4-5-16-11)18-8(2)14/h4-5,10-12H,6H2,1-3H3
charge 0 multiplicity 1
35 atoms
O  0.094947 0.727415 -2.489819
O  -0.121201 -1.446393 -0.41503
O  2.13701 1.313258 0.586103
O  -2.49357 0.923244 0.139995
O  -0.806912 -1.760112 1.800065
O  4.329675 0.552736 0.811499
O  -3.608675 -1.127642 -0.01537
C  0.279421 -0.051001 -0.096121
C  -0.392038 0.903583 -1.095429
C  1.812681 0.040424 -0.187961
C  -1.911085 0.725415 -1.211162
C  2.296417 0.117247 -1.605192
C  1.447591 0.413576 -2.627005
C  -0.688572 -2.201789 0.635449
C  3.465528 1.433943 1.017302
C  -3.311812 -0.107781 0.645817
C  -1.15271 -3.541357 0.126979
C  3.675662 2.755824 1.72321
C  -3.711227 0.185162 2.069898
H  -0.051509 0.194765 0.92789
H  -0.127969 1.932655 -0.779536
H  2.28982 -0.794612 0.353548
H  -2.338295 1.497443 -1.870619
H  -2.16092 -0.279838 -1.587865
H  3.343355 -0.108932 -1.816716
H  1.732969 0.41414 -3.682361
H  -1.14861 -4.276227 0.946071
H  -2.192203 -3.423857 -0.232389
H  -0.53116 -3.887409 -0.712605
H  2.852007 2.95765 2.427339
H  3.686354 3.573818 0.980352
H  4.637752 2.742009 2.255497
H  -3.684436 1.264469 2.280507
H  -2.988939 -0.323573 2.735399
H  -4.712343 -0.226552 2.270659
