program: Gaussian 09
title: 000102866
version: EM64L-G09RevD.01
frameworkgroup: C1[X(C12H14N2O2)]
method: RPBEPBE
basis: SDD
operation: Freq
keyword: #p
keyword: freq=noraman
keyword: PBEPBE/SDD
title: #p freq=noraman PBEPBE/SDD
converged: YES YES NO NO
title: Mulliken charges:
elementType: O O N N C C C C C C C C C C C C H H H H H H H H H H H H H H
charge: -0.202562 -0.195042 -0.116992 -0.213953 -0.195918 -0.471927 0.182190 -0.705419 0.467307 0.229367 -0.395158 -0.352518 -0.738486 -0.205957 -0.222870 -0.260316 0.263302 0.257210 0.245204 0.227692 0.244490 0.241156 0.235551 0.237356 0.256702 0.251222 0.259199 0.225021 0.224814 0.229335
chargesum: 0.00000
title: Mulliken charges with hydrogens summed into heavy atoms:
elementType: O O N N C C C C C C C C C C C C
charge: -0.202562 -0.195042 -0.116992 -0.213953 0.067384 0.030486 0.182190 0.007919 0.467307 0.229367 -0.159606 -0.115162 0.028638 0.019064 0.001944 -0.030982
polarizability: 1.86320633e+02 -2.88428496e+00 1.33855814e+02 -2.74090302e+00 -1.20948924e+01 1.18805884e+02
1716.lowfreq: -10.8205 -9.6441 -4.6962 -0.0009 0.0003 0.0007 44.4203 49.6387 62.7283
frequency: 44.3619 49.6045 62.6582 69.1567 98.8765 136.0623 154.0999 189.5768 229.5694 242.9895 255.6290 307.9963 331.8692 349.3038 379.0887 406.2833 414.8071 501.0893 515.3470 559.9454 584.2281 595.1779 612.9055 646.5945 678.0927 693.9244 714.6265 758.1061 807.8028 825.8523 842.3158 890.3941 921.5848 935.6354 961.2925 964.0955 980.9818 984.9862 1005.7735 1027.1047 1033.1020 1058.2728 1080.3772 1087.2095 1121.0082 1123.9308 1171.4270 1178.6972 1187.4424 1218.7253 1241.0876 1253.0025 1298.9464 1309.5173 1319.5345 1329.2719 1385.4259 1388.5574 1389.9496 1432.3763 1442.8997 1448.5884 1470.7716 1477.1886 1480.6289 1484.9807 1589.7295 1610.8705 1635.1374 1654.3093 2989.1827 3007.6045 3015.2500 3045.6051 3090.9399 3094.4646 3094.6438 3109.0459 3126.4838 3133.4074 3134.5785 3147.5704 3159.2965 3170.9863
redmass: 4.7766 4.0051 4.1580 3.6666 6.9814 3.4165 1.0432 4.5579 1.5449 1.8199 4.1648 4.3756 4.7581 2.4907 5.0402 2.9500 4.7490 4.7793 3.2516 4.0848 4.6724 3.9184 6.2224 5.8121 5.5675 1.9781 3.8201 1.7838 4.0269 1.2618 2.7971 1.4313 2.8270 2.1047 1.3810 1.7662 1.8674 2.4605 2.8968 2.0415 1.6890 2.2209 2.0732 1.6895 2.7876 2.2645 1.0472 2.9577 1.1419 1.7906 4.2257 1.7373 1.6845 1.9254 1.4421 1.2751 6.7489 1.2243 1.2173 1.0729 2.3867 1.0496 1.1681 1.2261 1.2185 1.3114 6.4626 6.2256 9.0220 11.4439 1.0350 1.0363 1.0661 1.0854 1.1005 1.1007 1.0964 1.1017 1.0848 1.0879 1.1024 1.0934 1.0946 1.1005
irintensity: 0.2192 1.4077 0.2614 6.8144 1.4012 3.9832 0.2561 1.6084 2.7193 3.7225 1.8968 6.7391 0.7298 0.4735 0.5947 0.7483 8.2448 9.3867 24.5261 1.1900 32.3052 2.7541 1.1053 3.4311 8.2095 27.7302 9.6113 72.0278 0.5624 0.6228 0.4714 1.7853 23.6586 28.5710 0.0815 6.1231 0.2491 0.3293 42.6684 23.0994 3.4512 2.6347 23.6590 3.2071 10.2793 17.0065 0.4243 133.4718 1.2386 10.4986 422.9671 29.7060 22.2813 10.2030 7.4895 7.6223 10.0275 43.4160 16.1359 27.5187 3.5317 19.2711 29.2612 9.8725 37.1292 28.1059 6.2212 73.0590 158.9179 281.9793 20.2986 1.6989 37.4681 15.0077 24.4932 17.7949 4.9070 14.8903 5.4766 3.2097 12.0615 25.5638 31.7004 9.4341
temp: 298.150 k
press: 1.00000 atm
elementType: 8 8 7 7 6 6 6 6 6 6 6 6 6 6 6 6 1 1 1 1 1 1 1 1 1 1 1 1 1 1
symmnumber: 1
zpe: 627751.3 jmol-1
zpe.correction: 0.239098 hartree
zpe.thermalcorrener: 0.254061 hartree
zpe.thermalcorrenthalpy: 0.255005 hartree
zpe.thermalcorrgfe: 0.196474 hartree
zpe.sumelectzpe: -724.435011 hartree
zpe.sumelectthermal: -724.420048 hartree
zpe.sumelectthermalent: -724.419104 hartree
zpe.sumelectthermalfe: -724.477634 hartree
dipole: 0.3921 3.5582 0.2229
dipole: 3.5867
quadrupole: -93.2951 -93.4212 -93.0449
quadrupole: 3.4814 4.7028 -10.9761
quadrupole: -0.0414 -0.1675 0.2088 3.4814 4.7028 -10.9761
hfenergy: -724.6741087 hartree
pointgroup: C01 [X(C12H14N2O2)]
dipole: -0.0582786 -1.4085147 -0.0623589 debye
polarizability: 186.4047179|0.2979343|130.9633543|2.8513195|13.5507721|121.6142577 unknown
InChI: InChI=1S/C12H14N2O2/c1-9-8-13(11-6-4-3-5-7-11)14(10(2)15)12(9)16/h3-7,9H,8H2,1-2H3
charge 0 multiplicity 1
30 atoms
O  3.169158 -0.398619 0.982397
O  0.546047 2.609515 -0.662395
N  0.142672 -0.112178 -0.91039
N  1.234209 0.441095 -0.144433
C  1.648042 -1.906528 -0.311993
C  0.651002 -1.436274 -1.40387
C  2.146648 -0.574683 0.278256
C  1.024631 -2.796485 0.793017
C  -1.162462 -0.044252 -0.306781
C  1.395247 1.872675 -0.10897
C  -2.264824 -0.530525 -1.060515
C  -1.391715 0.524024 0.972432
C  2.609508 2.391393 0.637424
C  -3.567667 -0.475942 -0.526253
C  -2.703609 0.585489 1.490465
C  -3.79891 0.081358 0.753788
H  2.5195 -2.424456 -0.748977
H  1.163035 -1.292662 -2.372085
H  -0.194826 -2.126658 -1.537878
H  0.741794 -3.779147 0.376102
H  1.750472 -2.961574 1.608331
H  0.119287 -2.330823 1.221248
H  -2.10409 -0.917305 -2.072979
H  -0.55885 0.920487 1.560348
H  2.616637 2.05204 1.687137
H  2.579974 3.490414 0.592436
H  3.54868 2.0199 0.192639
H  -4.407138 -0.85242 -1.121567
H  -2.866421 1.030445 2.478621
H  -4.81373 0.133596 1.161444
