program: Gaussian 09
title: 000102862
version: EM64L-G09RevD.01
frameworkgroup: C1[X(C11H18O)]
method: RPBEPBE
basis: SDD
operation: Freq
keyword: #pfreq=noraman
keyword: PBEPBE/SDD
title: #p freq=noraman PBEPBE/SDD
converged: YES YES NO NO
title: Mulliken charges:
elementType: O C C C C C C C C C C C H H H H H H H H H H H H H H H H H H
charge: -0.216250 -0.124664 -0.524417 -0.513555 0.226448 -0.303949 0.374523 -0.048381 -0.792597 -0.784948 -0.798496 -0.586042 0.219899 0.213373 0.242425 0.231157 0.232210 0.225079 0.214887 0.253890 0.230175 0.250776 0.215372 0.218924 0.229359 0.221207 0.222959 0.229463 0.213758 0.227412
chargesum: 0.00000
title: Mulliken charges with hydrogens summed into heavy atoms:
elementType: O C C C C C C C C C C C
charge: -0.216250 0.095235 -0.068619 -0.050187 0.226448 -0.078870 0.374523 0.166506 -0.057756 -0.121293 -0.124866 -0.144872
polarizability: 1.62973283e+02 -2.66022040e+00 1.04897655e+02 1.07247173e+01 -3.58051364e+00 1.04796934e+02
1716.lowfreq: -8.2759 -0.0005 0.0004 0.0006 6.8078 11.7628 18.7094 23.2405 45.1682
frequency: 17.8614 23.1439 45.0833 63.5050 79.0866 89.3758 118.0273 139.7138 162.3579 177.9607 209.9925 243.9954 281.7361 317.0523 339.6976 387.0125 410.6956 438.0145 487.8147 531.8361 575.8744 588.5131 641.6182 750.2083 784.5360 847.3727 868.0216 931.2985 936.2821 946.7533 948.3551 960.3726 981.0042 992.9601 999.8018 1006.1329 1041.5321 1061.6242 1081.2843 1095.8868 1128.3642 1160.2662 1186.7675 1217.5557 1233.1346 1277.1236 1282.3790 1297.2787 1311.3960 1330.7964 1357.5266 1362.4569 1388.9497 1398.8494 1425.3727 1440.2806 1449.9337 1454.7241 1459.2672 1461.5567 1470.7497 1472.9596 1484.0314 1629.3887 1656.7733 1687.4538 2957.9501 2963.8424 2973.6587 2979.9051 2988.3988 2994.0166 3029.0421 3032.5541 3043.3777 3049.0179 3057.0375 3070.0938 3078.9809 3087.5425 3091.3311 3093.0812 3118.2495 3196.9488
redmass: 2.9823 3.5091 3.3636 3.3821 2.3758 2.9598 1.0670 1.0400 3.1704 1.2215 2.5713 3.5075 2.7326 2.4270 2.4612 2.3334 2.1611 2.2340 2.3557 2.9835 2.4990 2.8216 1.6389 2.7387 2.3580 1.4669 1.8080 2.0553 1.6592 1.3855 1.3973 1.8616 2.2077 1.2799 1.9275 1.1637 1.9797 2.6412 1.6751 1.5200 2.3657 1.7689 1.9512 1.4094 1.8338 1.3150 1.2829 1.2575 1.2637 1.5668 1.3895 1.2740 1.3230 1.2267 1.1680 1.0734 1.0524 1.0519 1.0684 1.1088 1.0550 1.0666 1.0843 7.4328 4.6913 6.3524 1.0375 1.0383 1.0374 1.0598 1.0623 1.0808 1.0970 1.0963 1.1003 1.0971 1.0959 1.0841 1.0979 1.0915 1.0955 1.0717 1.1003 1.1149
irintensity: 0.3041 4.0965 2.3370 0.1774 0.0503 0.2392 0.3988 0.4434 1.4058 2.3634 1.0067 4.2259 1.0053 0.9742 0.6080 0.4901 5.3250 3.9271 2.4814 3.6814 9.5408 4.6174 8.5920 6.6765 7.4187 13.8565 6.1761 4.1523 1.7184 70.3443 0.9718 6.4213 13.1409 10.1587 2.0544 16.6227 10.8746 2.8063 2.8367 9.1352 6.2909 22.7427 52.9008 22.2930 1.1322 11.4178 3.5487 6.5805 2.7469 30.8146 1.9111 65.1850 28.8087 10.1647 3.7874 16.9667 17.1115 0.2413 8.4902 10.6495 29.5284 13.7382 10.7886 99.5993 16.8552 9.1256 35.6092 51.4523 1.7261 17.4130 17.4063 23.3977 3.4613 49.6374 7.3292 7.7693 10.2909 33.8828 12.7660 34.0833 50.3643 7.1350 17.6822 25.2818
temp: 298.150 k
press: 1.00000 atm
elementType: 8 6 6 6 6 6 6 6 6 6 6 6 1 1 1 1 1 1 1 1 1 1 1 1 1 1 1 1 1 1
symmnumber: 1
zpe: 678484.6 jmol-1
zpe.correction: 0.258421 hartree
zpe.thermalcorrener: 0.273912 hartree
zpe.thermalcorrenthalpy: 0.274856 hartree
zpe.thermalcorrgfe: 0.213227 hartree
zpe.sumelectzpe: -504.198663 hartree
zpe.sumelectthermal: -504.183173 hartree
zpe.sumelectthermalent: -504.182228 hartree
zpe.sumelectthermalfe: -504.243857 hartree
dipole: 2.0873 0.4218 2.8539
dipole: 3.5608
quadrupole: -74.5770 -75.7160 -76.1747
quadrupole: -2.2489 -4.4400 -4.8877
quadrupole: 0.9122 -0.2268 -0.6855 -2.2489 -4.4400 -4.8877
hfenergy: -504.4570845 hartree
pointgroup: C01 [X(C11H18O1)]
dipole: 0.8163253 0.1432934 1.1294818 debye
polarizability: 163.1446668|-0.8035319|105.0906141|10.6986963|-3.1175359|104.4325902 unknown
InChI: InChI=1S/C11H18O/c1-5-6-11(10(4)12)8-7-9(2)3/h5,7,11H,1,6,8H2,2-4H3
charge 0 multiplicity 1
30 atoms
O  -2.032779 -1.479436 -1.410436
C  -0.448916 -0.275722 -0.005857
C  0.777023 -0.577671 -0.937393
C  -1.038696 1.147629 -0.267252
C  -1.541691 -1.331995 -0.258089
C  1.934264 0.38334 -0.751331
C  3.051435 0.19231 0.011157
C  -2.093574 1.54442 0.744847
C  -1.997617 -2.16976 0.925276
C  4.134704 1.256581 0.090305
C  3.328485 -1.05511 0.832365
C  -3.397598 1.793381 0.462469
H  -0.11556 -0.335843 1.049318
H  1.103576 -1.620239 -0.761575
H  0.412099 -0.537943 -1.981579
H  -0.201437 1.871944 -0.222713
H  -1.455903 1.169917 -1.291194
H  1.856582 1.334411 -1.299137
H  -1.745915 1.633036 1.787514
H  -2.735498 -2.923823 0.609591
H  -1.134319 -2.666529 1.408192
H  -2.452199 -1.505041 1.685732
H  4.296257 1.583689 1.137034
H  5.105871 0.862258 -0.269994
H  3.882283 2.146203 -0.512443
H  3.415188 -0.801288 1.907899
H  4.29569 -1.508218 0.537615
H  2.546403 -1.82483 0.729414
H  -4.111149 2.082282 1.242793
H  -3.785913 1.712748 -0.560226
