program: Gaussian 09
title: 000102852
version: EM64L-G09RevD.01
frameworkgroup: C1[X(C7H13NO)]
method: RPBEPBE
basis: SDD
operation: Freq
keyword: #p
keyword: freq=noraman
keyword: PBEPBE/SDD
title: #p freq=noraman PBEPBE/SDD
converged: YES YES NO NO
title: Mulliken charges:
elementType: O N C C C C C C C H H H H H H H H H H H H H
charge: -0.275729 -0.054634 0.000382 -0.425934 -0.418945 -0.384886 -0.393937 -0.728729 -0.061761 0.216599 0.187916 0.220401 0.207971 0.214260 0.214048 0.205091 0.262243 0.213330 0.222069 0.215430 0.208745 0.156071
chargesum: 0.00000
title: Mulliken charges with hydrogens summed into heavy atoms:
elementType: O N C C C C C C C
charge: -0.275729 -0.054634 0.216981 -0.017618 0.003286 0.034253 0.081636 -0.082486 0.094311
polarizability: 1.02864655e+02 -1.51024445e-01 8.25809930e+01 -4.62414477e+00 1.62861038e+00 6.45655064e+01
1716.lowfreq: -18.3174 -2.8150 0.0004 0.0004 0.0005 21.5135 65.5836 129.6282 198.7216
frequency: 65.5319 129.6181 198.7203 208.2830 271.3919 289.1244 315.5968 341.6458 399.3018 419.3745 437.2524 532.0586 682.0566 770.1146 817.6269 848.8729 882.2011 893.6678 953.2142 959.2585 971.7721 988.4755 1061.4081 1090.0709 1121.7123 1136.1805 1151.2086 1190.3146 1219.3331 1246.7087 1274.5752 1296.8720 1309.5459 1337.3809 1340.0980 1348.8775 1359.1278 1381.1792 1390.0597 1407.6412 1457.6947 1461.2285 1465.1121 1472.1822 1476.6275 1477.8210 1624.3355 2913.8953 2940.1057 2956.7124 2962.5494 2970.4852 2976.8478 2990.6608 3029.9471 3037.1325 3054.4414 3064.3243 3072.4011 3077.2197
redmass: 4.6443 2.7614 1.0470 2.6668 2.0659 2.5402 3.0032 2.4671 3.0495 2.3372 2.6566 2.3016 3.7867 2.5175 2.8269 1.4416 1.4629 2.3570 1.8538 1.5730 1.6267 1.4972 1.9129 2.2580 2.0731 1.8314 1.5564 2.0246 1.5414 2.0747 1.2161 1.2933 1.2901 1.4535 1.3496 1.3800 1.4921 1.3296 1.2310 2.3008 1.0904 1.0875 1.0813 1.0847 1.0563 1.0546 6.5982 1.0849 1.0661 1.0652 1.0682 1.0379 1.0787 1.0615 1.0964 1.0972 1.1021 1.0991 1.0991 1.0955
irintensity: 2.0638 2.6839 0.1934 4.1091 3.2475 4.8321 7.0614 4.8713 5.4592 3.8421 1.2006 2.6548 6.1324 3.9610 2.2408 15.1433 4.3191 3.8624 4.9967 2.7140 13.4325 4.7788 11.8566 15.4020 26.6079 9.4414 1.9520 21.6524 23.6793 23.3489 13.0881 2.0137 1.7723 1.2629 0.6861 5.7265 0.4798 17.1019 10.7750 62.9848 14.5353 15.1900 7.6978 9.3156 17.8182 14.8050 415.9945 89.8806 41.1638 16.1342 41.1207 33.0751 56.5225 25.6237 51.8269 16.4403 43.6521 69.3160 37.4972 9.7739
temp: 298.150 k
press: 1.00000 atm
elementType: 8 7 6 6 6 6 6 6 6 1 1 1 1 1 1 1 1 1 1 1 1 1
symmnumber: 1
zpe: 505536.9 jmol-1
zpe.correction: 0.192549 hartree
zpe.thermalcorrener: 0.201638 hartree
zpe.thermalcorrenthalpy: 0.202583 hartree
zpe.thermalcorrgfe: 0.158729 hartree
zpe.sumelectzpe: -403.803253 hartree
zpe.sumelectthermal: -403.794164 hartree
zpe.sumelectthermalent: -403.793220 hartree
zpe.sumelectthermalfe: -403.837073 hartree
dipole: -4.8372 -0.0483 0.8067
dipole: 4.9042
quadrupole: -72.7878 -51.0371 -55.0455
quadrupole: 1.0198 2.5406 0.4019
quadrupole: -13.1644 8.5863 4.5780 1.0198 2.5406 0.4019
hfenergy: -403.9958021 hartree
pointgroup: C01 [X(C7H13N1O1)]
dipole: 1.8953316 0.1253871 0.3389248 debye
dipolederiv: -1.3303355 0.0623469 -0.2134376 -0.3852442 -0.4611987 -0.0741475 -0.21575 0.0340865 -0.4146052 -1.1962896 0.1124365 -0.1583929 0.4090925 -0.5624637 0.105413 -0.1943204 0.0294442 -0.3937842 0.0284342 -0.0294552 -0.0085789 -0.029013 0.0723014 -0.0301642 -0.022262 -0.0330081 0.1235244 0.0356529 -0.0460582 0.0091115 -0.0416541 0.0156829 -0.0002104 0.0382007 -0.0215414 0.1506004 0.4763522 0.131329 0.0790464 0.2075877 0.1657604 0.0539915 0.0504467 0.0675668 0.3134349 0.0756175 0.0121069 0.0397248 0.0045312 0.0459902 -0.00521 0.0284807 0.0026771 0.1031753 -0.0172582 -0.0498248 -0.0300649 -0.1834746 0.4231172 -0.0899467 -0.055781 -0.0648598 0.3167104 -0.0517439 -0.0484343 -0.0087818 -0.0347592 0.017599 -0.015568 0.0355301 -0.0060249 0.0922553 1.8757299 -0.1642242 0.4531662 -0.0728961 0.6451313 -0.1116214 0.5421202 -0.145994 0.2371115 0.0173615 0.0145749 -0.0732504 0.0075499 0.0272557 -0.003062 -0.0448438 0.0173119 -0.1635003 0.0468406 -0.0121243 -0.0497409 -0.0237091 0.035119 -0.0081929 -0.1069613 0.0414657 -0.1685423 -0.1199392 0.0890406 0.0991243 0.0729301 0.017013 -0.0369909 0.1236314 -0.0606141 0.0095858 -0.0588826 -0.0338022 -0.0768974 -0.0283723 0.0749319 0.035878 -0.095887 -0.0426744 -0.1695904 0.0475504 0.0742953 -0.0096073 0.0115687 -0.1474947 0.0211765 -0.0047934 0.0680566 0.0742754 0.0111657 -0.011387 -0.0368306 0.0030683 0.0903597 0.0330217 -0.0336876 -0.0328345 -0.1541568 0.0245544 0.023289 -0.0027385 0.0136471 -0.2078729 0.0443867 0.0063127 0.0740206 0.0730894 -0.0137607 -0.1104009 0.0078403 -0.0205694 0.0625685 -0.0022326 -0.0131311 -0.0305794 0.0961094 0.0726965 0.0556201 -0.0708185 0.0687997 -0.0078021 0.0029012 -0.0227178 0.0625832 -0.1795729 -0.1073285 0.0365247 0.0864504 0.0905422 0.0594197 -0.0662011 0.1107081 -0.046133 0.0224961 0.0711426 0.0355721 -0.0200855 -0.0350078 -0.1859338 0.0499668 -0.0138768 0.0521623 0.0811742 0.0675915 -0.0161598 -0.0151199 -0.0007695 0.0791595 0.0463209 -0.090893 -0.0018139 -0.1570301 0.0448482 -0.125265 -0.0001186 -0.0338481 -0.2586436 0.0504914 -0.0205254 0.0367028 0.1072397 unknown
polarizability: 102.7042307|1.0077393|82.6080768|5.1490336|-1.4710138|64.6988472 unknown
InChI: InChI=1S/C7H13NO/c1-7-3-2-4-8(5-7)6-9/h6-7H,2-5H2,1H3
charge 0 multiplicity 1
22 atoms
O  -3.125847 0.208603 -0.40508
N  -0.870891 0.254642 0.266453
C  1.546697 0.450509 -0.353666
C  1.693749 -1.061609 -0.040858
C  0.363587 1.035066 0.462539
C  0.368632 -1.825666 -0.276263
C  -0.782922 -1.195185 0.538912
C  2.845095 1.228907 -0.058984
C  -2.042814 0.826296 -0.193542
H  1.296894 0.556473 -1.430249
H  2.004253 -1.17903 1.01975
H  2.503472 -1.494526 -0.659082
H  0.639814 1.028843 1.539966
H  0.171167 2.085265 0.172725
H  0.105273 -1.799375 -1.351397
H  0.478262 -2.888682 0.010947
H  -1.7615 -1.635001 0.282869
H  -0.603937 -1.347842 1.623978
H  3.689433 0.823703 -0.646115
H  2.744169 2.30146 -0.310474
H  3.116049 1.155421 1.012023
H  -1.931434 1.922729 -0.367352
