program: Gaussian 09
title: 000102859
version: EM64L-G09RevD.01
frameworkgroup: C1[X(C11H21BrO2)]
method: RPBEPBE
basis: SDD
operation: Freq
keyword: #p
keyword: freq=noraman
keyword: PBEPBE/SDD
title: #p freq=noraman PBEPBE/SDD
converged: YES YES NO NO
title: Mulliken charges:
elementType: Br O O C C C C C C C C C C C H H H H H H H H H H H H H H H H H H H H H
charge: 0.015444 -0.398660 -0.211541 -0.386743 -0.381256 -0.377276 -0.373161 -0.389918 -0.352983 -0.328460 -0.356649 -0.581641 -0.696105 0.250446 0.197368 0.193665 0.192589 0.194741 0.194913 0.203735 0.190588 0.189684 0.196486 0.224115 0.188538 0.187853 0.250519 0.231812 0.194749 0.195100 0.322747 0.215458 0.210034 0.209676 0.384137
chargesum: 0.00000
title: Mulliken charges with hydrogens summed into heavy atoms:
elementType: Br O O C C C C C C C C C C C
charge: 0.015444 -0.014524 -0.211541 0.004290 0.006073 0.021372 0.007111 0.030682 0.023408 0.153871 0.033200 -0.258894 -0.060937 0.250446
polarizability: 1.92288675e+02 -9.98331888e+00 1.30881715e+02 -1.85542037e+00 -2.70772161e+00 1.11518277e+02
1716.lowfreq: -10.9283 -5.8234 -0.0005 -0.0001 0.0003 7.2053 14.6703 20.7965 32.8345
frequency: 14.5988 18.4643 32.7851 49.7283 53.3595 72.0841 89.7313 98.9908 116.9897 121.8955 139.9930 148.8469 158.9508 181.4416 226.1979 251.4838 259.4924 313.6721 366.8278 445.6956 461.6832 505.0034 530.1959 585.9971 645.7840 719.0018 723.5094 733.6976 738.1508 757.9332 793.2796 836.7894 887.7683 894.2917 957.7782 985.8363 993.1863 1014.4854 1025.5398 1041.6254 1046.6436 1066.3449 1077.3382 1081.4275 1084.3029 1120.8003 1129.9443 1169.4530 1185.4439 1213.9878 1215.6346 1241.5451 1252.1697 1260.8104 1276.9687 1280.2029 1287.4632 1289.2892 1293.4897 1297.6615 1317.7303 1339.0800 1350.0285 1355.3346 1355.9844 1364.9489 1388.2523 1454.9786 1459.9715 1460.8503 1463.6477 1466.9634 1473.2133 1475.9561 1479.5124 1485.2012 1488.7452 1657.6359 2949.3171 2949.9885 2953.0906 2956.9182 2961.9279 2967.5269 2969.9635 2971.2261 2983.2593 2989.8056 2998.9668 3009.1019 3011.4891 3022.1976 3034.1374 3043.6232 3067.5547 3070.3529 3075.6651 3101.4842 3515.5319
redmass: 4.6403 1.6705 4.9786 4.1575 7.8198 1.5717 4.1997 3.3759 2.0433 3.7476 2.5122 1.9472 5.2687 4.9345 1.1167 3.2832 4.0234 4.4150 3.2230 3.7680 3.0848 3.2920 2.6523 3.5999 1.5259 1.0602 1.0795 1.3649 3.2848 1.3369 1.5720 1.5122 1.8899 1.3501 1.2567 4.8663 4.2901 1.1718 3.6339 2.9792 2.5806 2.6415 1.9027 2.0827 2.0950 2.5742 1.6112 1.3992 1.7425 1.3062 1.4650 1.4045 1.2920 1.3846 1.1446 1.0972 1.2630 1.1047 1.1503 1.1014 1.3546 1.4121 1.5321 1.6585 1.6218 1.7408 1.2174 1.0845 1.0724 1.0724 1.0641 1.0817 1.0819 1.0430 1.0845 1.0903 1.0931 8.7560 1.0588 1.0588 1.0592 1.0592 1.0590 1.0590 1.0599 1.0364 1.0963 1.0979 1.0998 1.0886 1.0733 1.1032 1.1044 1.1045 1.1007 1.0993 1.1017 1.0895 1.0641
irintensity: 0.0584 0.0386 0.3973 0.1763 1.8337 0.0154 0.1743 0.3478 0.1891 0.3519 0.0472 0.0124 0.8427 0.1767 0.0015 1.7487 2.0856 3.3950 2.0518 5.9338 5.2204 20.7264 13.4293 9.6336 196.6831 16.2388 0.8199 6.6770 3.5787 1.1184 1.8718 1.6472 4.5258 0.5104 1.7523 7.3765 6.2141 0.9851 83.9895 151.3114 35.4711 4.5783 4.7086 0.4259 3.2586 19.7586 23.0273 6.5049 0.8098 21.5785 3.8051 0.2477 4.3209 4.9997 1.3780 1.8846 7.2731 0.5436 1.5283 1.5623 7.2779 2.4828 0.2043 0.2833 3.5234 28.9032 11.0438 5.5408 0.1383 0.7489 0.2630 0.4947 2.6401 12.3590 2.3867 4.0160 31.8231 201.5877 0.0388 0.3835 0.3901 3.8005 19.5414 59.6173 160.4588 38.6528 0.7169 0.6660 0.3806 3.5661 13.8599 1.7919 16.7062 174.1858 96.0346 55.3799 27.2532 7.6891 34.3954
temp: 298.150 k
press: 1.00000 atm
elementType: 35 8 8 6 6 6 6 6 6 6 6 6 6 6 1 1 1 1 1 1 1 1 1 1 1 1 1 1 1 1 1 1 1 1 1
symmnumber: 1
zpe: 791358.7 jmol-1
zpe.correction: 0.301413 hartree
zpe.thermalcorrener: 0.319734 hartree
zpe.thermalcorrenthalpy: 0.320678 hartree
zpe.thermalcorrgfe: 0.249711 hartree
zpe.sumelectzpe: -594.536781 hartree
zpe.sumelectthermal: -594.518460 hartree
zpe.sumelectthermalent: -594.517516 hartree
zpe.sumelectthermalfe: -594.588482 hartree
dipole: -1.7525 0.8422 -1.5034
dipole: 2.4578
quadrupole: -104.9455 -92.2976 -100.9415
quadrupole: 6.2342 -2.1835 -1.4674
quadrupole: -5.5506 7.0972 -1.5466 6.2342 -2.1835 -1.4674
hfenergy: -594.8381935 hartree
pointgroup: C01 [X(C11H21Br1O2)]
dipole: -0.6713717 0.4173596 -0.5568574 debye
polarizability: 190.6476013|-13.7600352|132.7208767|-3.756889|-0.9318934|111.3201891 unknown
InChI: InChI=1S/C11H21BrO2/c1-2-3-4-5-6-7-8-9-10(12)11(13)14/h10,13H,2-9H2,1H3
charge 0 multiplicity 1
35 atoms
Br 5.443981 -1.682756 -0.143687
O  5.061701 1.731736 -0.585816
O  3.945695 1.229917 1.39264
C  -1.207986 0.114598 -0.334838
C  -2.538966 -0.511539 0.139037
C  0.027945 -0.730032 0.047407
C  -3.780351 0.326024 -0.242414
C  1.361264 -0.097579 -0.413785
C  -5.109807 -0.297596 0.238743
C  2.577829 -0.975805 -0.018035
C  -6.352612 0.539159 -0.141964
C  3.898595 -0.372397 -0.494693
C  -7.675656 -0.090158 0.345385
C  4.28095 0.910201 0.232744
H  -1.106353 1.131062 0.099419
H  -1.237102 0.247701 -1.436647
H  -2.638978 -1.530347 -0.290893
H  -2.509992 -0.641459 1.241152
H  -0.070477 -1.74412 -0.393093
H  0.052345 -0.867303 1.14798
H  -3.679101 1.346168 0.184085
H  -3.812973 0.452572 -1.345045
H  1.339889 0.042594 -1.514466
H  1.462013 0.908208 0.039806
H  -5.078727 -0.423381 1.341471
H  -5.212865 -1.318121 -0.186604
H  2.610119 -1.09449 1.080091
H  2.465934 -1.981473 -0.463159
H  -6.384319 0.663346 -1.243838
H  -6.24821 1.55885 0.282264
H  3.945556 -0.219358 -1.583605
H  -8.547938 0.527517 0.062481
H  -7.680797 -0.198214 1.446599
H  -7.819373 -1.097397 -0.089755
H  5.330565 2.546572 -0.080467
