program: Gaussian 09
title: 000102858
version: EM64L-G09RevD.01
frameworkgroup: C1[X(C9H17BrO2)]
method: RPBEPBE
basis: SDD
operation: Freq
keyword: #p
keyword: freq=noraman
keyword: PBEPBE/SDD
title: #p freq=noraman PBEPBE/SDD
converged: YES YES NO NO
title: Mulliken charges:
elementType: Br O O C C C C C C C C C H H H H H H H H H H H H H H H H H
charge: 0.019015 -0.400185 -0.210178 -0.382300 -0.362572 -0.400164 -0.352615 -0.361963 -0.355343 -0.565508 -0.694923 0.252043 0.195024 0.198531 0.191992 0.188748 0.209221 0.227147 0.188052 0.188015 0.255172 0.227564 0.195462 0.195502 0.333721 0.210146 0.209953 0.216516 0.383928
chargesum: 0.00000
title: Mulliken charges with hydrogens summed into heavy atoms:
elementType: Br O O C C C C C C C C C
charge: 0.019015 -0.016258 -0.210178 0.011255 0.018167 0.036204 0.023453 0.120773 0.035621 -0.231787 -0.058309 0.252043
polarizability: 1.50005782e+02 1.10891477e+01 1.08155751e+02 3.60373867e+00 1.31992600e+00 1.02965108e+02
1716.lowfreq: -17.3948 -6.6990 -3.2632 -0.0005 0.0000 0.0003 21.0112 29.4302 40.0011
frequency: 19.5316 29.0583 39.9726 49.6359 64.3020 108.9217 112.0618 125.4689 146.4860 167.0602 194.2868 226.6274 242.3967 273.4386 340.7985 406.0827 446.7069 482.3778 534.3983 583.8530 644.8252 716.3322 724.2959 744.6522 766.1953 797.3539 863.9708 876.3437 906.6161 941.5939 996.5908 1006.1327 1034.7222 1049.8775 1069.0643 1080.8213 1091.6622 1116.4999 1121.5776 1167.2386 1191.0064 1213.2403 1233.7756 1246.9275 1265.6933 1277.3052 1282.7681 1290.7192 1296.0952 1322.7585 1334.2921 1350.8450 1353.7304 1369.5627 1388.8130 1458.2239 1461.8268 1463.3515 1468.3782 1475.0531 1476.8355 1483.0692 1488.1132 1658.3132 2950.1735 2951.1467 2958.4059 2967.7806 2971.7929 2980.6870 2985.3090 2995.7803 3009.2638 3014.9125 3032.1851 3045.2192 3068.1040 3071.3928 3076.7158 3115.3813 3515.8268
redmass: 4.6437 1.7673 4.5645 5.8551 3.8280 1.9844 2.7185 2.8499 4.7812 4.0062 4.4906 1.1297 3.3085 2.5199 4.2906 2.6886 3.5509 3.4276 2.2939 3.7379 1.5377 1.5046 1.1739 1.7104 1.9410 1.5788 1.5723 2.0440 1.8212 1.6896 1.5583 2.5639 2.5182 3.1537 2.3401 2.1381 2.2003 1.5551 2.2016 1.2340 1.6335 1.4028 1.3426 1.3836 1.3716 1.1811 1.0678 1.2141 1.1437 1.3734 1.4154 1.6336 1.6424 1.6290 1.2156 1.0919 1.0720 1.0737 1.0714 1.0737 1.0428 1.0833 1.0919 8.7224 1.0587 1.0589 1.0592 1.0590 1.0363 1.0599 1.0970 1.0997 1.0731 1.0933 1.1028 1.1018 1.1007 1.0993 1.1019 1.0879 1.0641
irintensity: 0.3367 0.0634 0.4625 1.4033 0.4151 0.0077 0.0835 0.1778 0.8290 1.0054 1.1672 0.0048 0.4114 1.3457 3.0074 1.0589 16.0223 7.9273 10.2535 18.9908 185.2099 16.8159 6.2360 0.8426 19.4682 1.3270 3.2402 1.6781 5.1779 17.5756 0.6433 16.9929 185.6517 17.0885 25.6764 2.4452 8.6080 16.9160 17.0674 7.9441 0.3389 7.7473 1.0743 1.8161 8.3962 1.7257 0.3383 1.6799 4.0190 4.9078 4.1743 1.9820 7.8982 18.5120 11.2494 16.5244 0.2506 0.5256 1.3849 2.9911 12.6992 2.2142 27.1551 193.4091 0.9812 0.0952 24.7626 96.8614 36.6619 53.3403 0.8142 1.0747 7.0155 1.7322 25.1899 109.1430 92.9799 54.3568 18.1054 4.7027 32.9704
temp: 298.150 k
press: 1.00000 atm
elementType: 35 8 8 6 6 6 6 6 6 6 6 6 1 1 1 1 1 1 1 1 1 1 1 1 1 1 1 1 1
symmnumber: 1
zpe: 645209.5 jmol-1
zpe.correction: 0.245747 hartree
zpe.thermalcorrener: 0.261162 hartree
zpe.thermalcorrenthalpy: 0.262106 hartree
zpe.thermalcorrgfe: 0.198947 hartree
zpe.sumelectzpe: -516.089556 hartree
zpe.sumelectthermal: -516.074141 hartree
zpe.sumelectthermalent: -516.073197 hartree
zpe.sumelectthermalfe: -516.136356 hartree
dipole: 2.4804 0.2257 -0.5731
dipole: 2.5557
quadrupole: -90.5298 -80.4294 -86.6879
quadrupole: -1.3016 3.2727 -6.6908
quadrupole: -4.6474 5.4530 -0.8055 -1.3016 3.2727 -6.6908
hfenergy: -516.335303 hartree
pointgroup: C01 [X(C9H17Br1O2)]
dipole: 0.9744187 0.240508 -0.0605596 debye
polarizability: 147.0771035|9.7954125|106.7059843|12.3943738|4.3005922|107.3435537 unknown
InChI: InChI=1S/C9H17BrO2/c1-2-3-4-5-6-7-8(10)9(11)12/h8,11H,2-7H2,1H3
charge 0 multiplicity 1
29 atoms
Br -4.046903 -1.00432 -1.3750
O  -2.632928 2.090249 -0.64145
O  -3.068274 1.072183 1.404815
C  0.771679 -0.662846 -0.019358
C  2.141518 -0.4051 0.648553
C  -0.352939 -0.922793 1.010381
C  3.274602 -0.131806 -0.366227
C  -1.712037 -1.357247 0.39362
C  4.645079 0.122104 0.302282
C  -2.31719 -0.290417 -0.521788
C  5.771219 0.394947 -0.718266
C  -2.721349 0.982512 0.208436
H  0.855515 -1.535511 -0.700705
H  0.517351 0.209052 -0.656774
H  2.054801 0.457203 1.342409
H  2.413093 -1.280959 1.274373
H  -0.031571 -1.733118 1.694688
H  -0.501016 -0.026336 1.644152
H  3.005428 0.745468 -0.991215
H  3.361337 -0.993124 -1.061468
H  -2.430885 -1.576454 1.203105
H  -1.572114 -2.282748 -0.195044
H  4.557466 0.982582 0.996812
H  4.913899 -0.754454 0.926576
H  -1.698763 -0.046709 -1.397008
H  5.902794 -0.46437 -1.402766
H  5.538592 1.28259 -1.336524
H  6.738813 0.577423 -0.215608
H  -2.935217 2.906399 -0.157502
