program: Gaussian 09
title: 000102961
version: EM64L-G09RevD.01
frameworkgroup: C1[X(C18H17N3O7)]
method: RPBEPBE
basis: SDD
operation: Freq
keyword: #p
keyword: freq=noraman
keyword: PBEPBE/SDD
title: #p freq=noraman PBEPBE/SDD
converged: YES YES NO NO
title: Mulliken charges:
elementType: O O O O O O O N N N C C C C C C C C C C C C C C C C C C H H H H H H H H H H H H H H H H H
charge: -0.282197 -0.290594 -0.190327 -0.245884 -0.286779 -0.208136 -0.206441 -0.380760 -0.615534 0.024103 -0.188698 -0.553942 0.202704 0.271698 0.326356 -0.479934 0.388849 0.483409 -0.375265 -0.280287 -0.362334 -0.402933 0.380772 -0.327698 -0.346432 -0.227590 -0.224956 -0.234466 0.328409 0.217467 0.271567 0.322795 0.248742 0.222767 0.273947 0.310838 0.274420 0.231480 0.292508 0.290052 0.317949 0.344111 0.230437 0.226605 0.229202
chargesum: 0.00000
title: Mulliken charges with hydrogens summed into heavy atoms:
elementType: O O O O O O O N N N C C C C C C C C C C C C C C C C C C
charge: -0.282197 -0.290594 -0.190327 -0.245884 -0.286779 -0.208136 -0.206441 -0.057965 0.046526 0.024103 0.139711 -0.064907 0.202704 0.271698 0.326356 -0.008425 0.388849 0.483409 -0.101318 0.030551 -0.087914 -0.171453 0.380772 -0.035190 -0.056380 0.002848 0.001649 -0.005264
polarizability: 3.70833447e+02 -2.84274532e+01 1.93736175e+02 1.97026201e+01 3.79278658e+01 1.88841712e+02
1716.lowfreq: -4.4115 -1.1939 -0.0005 0.0004 0.0007 3.1609 5.2731 12.9168 19.2993
frequency: 4.9686 12.8205 19.0999 23.3216 29.1356 37.4669 38.6939 44.5275 47.2862 68.1634 68.7061 93.1740 103.8497 132.8294 151.7475 155.3348 165.8811 218.0027 236.0097 244.2294 294.7873 308.7926 320.2497 335.2879 347.3232 366.1598 402.7308 404.6368 415.8237 432.4700 468.2766 484.2782 499.8537 505.9892 513.4187 529.5821 546.4203 579.2782 595.1504 617.0978 617.3516 632.8171 646.6187 656.8561 664.9661 681.6951 697.9141 706.5013 731.9105 734.1822 752.8988 759.1201 805.9089 814.7693 845.3078 851.4306 854.8721 861.3514 874.5574 882.8127 917.7639 933.8339 969.6244 983.5926 988.4542 988.5652 994.7813 1000.2526 1001.3315 1003.2436 1027.0520 1033.6401 1069.7707 1090.8664 1092.9236 1095.9878 1112.0155 1143.4557 1155.7337 1173.2164 1177.2495 1190.1349 1194.3877 1218.7784 1222.0296 1222.8316 1240.7673 1265.2437 1287.7039 1290.9622 1330.3824 1338.5189 1355.8417 1362.7165 1367.0925 1385.7557 1401.9819 1423.2874 1441.1233 1443.0877 1461.3543 1470.2044 1484.3449 1488.2370 1591.0362 1594.4946 1600.1697 1607.6094 1614.9225 1651.6645 1658.6900 1663.2768 2996.1036 3025.6053 3033.8111 3065.0567 3108.8329 3118.5298 3128.5144 3140.2420 3151.0581 3165.1482 3171.9071 3181.8357 3191.9351 3216.3312 3517.8495 3564.3361 3672.4053
redmass: 6.6888 5.7073 5.7806 6.8427 4.4741 5.7122 7.3839 9.6521 6.9456 8.9264 7.2199 7.0296 5.7261 6.9669 5.8950 5.3667 7.8357 8.8680 7.2443 5.9696 5.2028 5.9840 6.6284 4.0170 3.2476 3.2513 3.9979 3.2300 3.0168 3.2987 3.8023 1.5039 3.0905 6.2749 1.8069 3.1163 1.5802 2.6410 4.4040 6.2171 6.2130 6.0989 3.0866 3.7007 4.7861 2.9346 7.0938 2.0200 7.6393 5.3389 5.8452 2.3269 7.8542 3.5535 1.2730 3.5605 4.9970 1.3109 1.5671 2.5073 4.8780 1.4866 2.2763 1.4621 1.3355 4.1475 3.6271 2.7908 1.3963 1.3388 2.2165 2.7651 2.5695 1.8253 2.5435 2.8934 1.3168 2.6019 1.7710 1.0561 1.8362 1.1293 2.1814 1.9039 6.0152 2.6462 1.1702 1.3827 1.6285 1.2874 1.2568 1.2964 1.3328 8.0679 2.8012 7.7320 11.2882 3.9356 1.1165 2.1752 1.1260 2.3585 2.2520 1.8413 7.3185 6.0893 1.4056 6.9672 6.0505 4.0753 10.1458 8.5079 1.0615 1.0821 1.0587 1.1006 1.1070 1.0870 1.0874 1.0918 1.0964 1.1015 1.0897 1.0914 1.0971 1.0953 1.0451 1.0772 1.1043
irintensity: 0.3562 0.1800 0.5743 1.0163 2.8937 1.6755 8.7104 3.0422 2.5091 7.4806 0.1289 1.9155 8.9834 0.8905 0.9541 7.9218 0.5899 3.0802 6.6990 12.4167 8.5228 4.6995 8.5329 3.3517 7.6225 22.4224 3.8384 1.1751 0.0334 15.7298 7.3094 25.1847 20.4377 2.6867 128.8063 46.5397 70.1548 62.3454 7.5943 10.7307 1.7555 21.7905 47.7794 28.1634 20.7729 15.9585 10.3850 57.3970 8.2495 11.1713 55.8222 57.2278 10.0401 8.6738 4.1553 4.2365 10.3030 1.9560 80.4450 15.0663 291.9206 5.9569 119.2055 13.8581 1.1325 58.8714 241.9645 7.4504 1.4115 7.5558 1.6948 59.8579 146.6238 92.1971 27.2393 352.6589 60.5233 307.5289 116.4628 0.6406 194.7796 0.3661 44.3372 173.8658 335.7120 12.8470 6.9864 111.9881 46.8510 1.5179 5.6028 71.6182 32.3688 83.0705 132.6242 0.6136 29.2378 47.1057 64.7010 9.4385 16.1753 105.8151 8.6897 367.6394 72.3383 1.7441 65.5572 74.1317 0.2742 128.1270 284.9622 237.2424 21.9612 35.9415 31.8827 13.2652 5.2634 6.5494 3.1962 18.1844 24.8063 23.6800 0.4608 1.7811 3.0634 3.7614 40.1298 33.0143 26.6484
temp: 298.150 k
press: 1.00000 atm
elementType: 8 8 8 8 8 8 8 7 7 7 6 6 6 6 6 6 6 6 6 6 6 6 6 6 6 6 6 6 1 1 1 1 1 1 1 1 1 1 1 1 1 1 1 1 1
symmnumber: 1
zpe: 874519.1 jmol-1
zpe.correction: 0.333087 hartree
zpe.thermalcorrener: 0.359414 hartree
zpe.thermalcorrenthalpy: 0.360358 hartree
zpe.thermalcorrgfe: 0.268402 hartree
zpe.sumelectzpe: -1384.864765 hartree
zpe.sumelectthermal: -1384.838438 hartree
zpe.sumelectthermalent: -1384.837494 hartree
zpe.sumelectthermalfe: -1384.929450 hartree
dipole: -5.6870 4.4053 -4.9038
dipole: 8.7060
quadrupole: -203.8595 -145.3394 -156.8440
quadrupole: 6.9152 6.2756 -9.3499
quadrupole: -35.1785 23.3415 11.8370 6.9152 6.2756 -9.3499
hfenergy: -1385.1978521 hartree
pointgroup: C01 [X(C18H17N3O7)]
dipole: -2.1676089 1.3182482 -2.3012708 debye
polarizability: 369.390408|-22.1530649|205.4212204|32.2853914|34.4296382|178.5997051 unknown
InChI: InChI=1S/C18H17N3O7/c19-16(22)10-15(20-18(24)27-11-12-4-2-1-3-5-12)17(23)28-14-8-6-13(7-9-14)21(25)26/h1-9,15,20H,10-11,19H2
charge 0 multiplicity 1
45 atoms
O  2.161951 0.688248 0.082368
O  -2.985187 -1.513393 -0.837385
O  1.367183 -1.076548 -1.270727
O  -1.538574 3.152176 0.307086
O  -1.944671 -0.729311 1.135854
O  8.324899 0.388674 1.625059
O  8.188755 -1.496061 0.345682
N  -1.264873 -0.047008 -1.008191
N  -1.734868 3.809294 -1.910641
N  7.667643 -0.448081 0.892199
C  -0.14762 0.762171 -0.547587
C  -0.044942 2.097751 -1.329002
C  1.176027 -0.017547 -0.648691
C  -1.176668 3.050179 -0.898925
C  -2.049783 -0.757463 -0.11646
C  -3.973691 -2.282866 -0.003382
C  3.522308 0.302171 0.221445
C  -5.247044 -1.494417 0.211442
C  4.270526 1.19435 1.027396
C  4.116433 -0.844208 -0.364511
C  -5.305677 -0.485843 1.20928
C  -6.395073 -1.753878 -0.578493
C  6.227394 -0.187365 0.663389
C  5.634791 0.95271 1.253032
C  5.485858 -1.083122 -0.135412
C  -6.49293 0.252438 1.405604
C  -7.585469 -1.018755 -0.378916
C  -7.635834 -0.012954 0.613907
H  -0.327884 1.010264 0.515952
H  -0.047815 1.915159 -2.420629
H  0.91321 2.586326 -1.072381
H  -1.371613 -0.259125 -2.001154
H  -3.478748 -2.531308 0.951527
H  -4.148759 -3.193542 -0.597276
H  3.766105 2.059504 1.466078
H  3.52684 -1.527262 -0.975513
H  -4.416388 -0.282629 1.816793
H  -6.356421 -2.532474 -1.350576
H  6.241891 1.619784 1.869691
H  5.984832 -1.95447 -0.567263
H  -1.461833 3.706711 -2.886189
H  -2.465854 4.478541 -1.667872
H  -6.528798 1.029916 2.176728
H  -8.469046 -1.229888 -0.991712
H  -8.558384 0.557351 0.77138
