program: Gaussian 09
title: 000102855
version: EM64L-G09RevD.01
frameworkgroup: C1[X(C11H22O2)]
method: RPBEPBE
basis: SDD
operation: Freq
keyword: #pfreq=noraman
keyword: PBEPBE/SDD
title: #p freq=noraman PBEPBE/SDD
converged: YES YES NO NO
title: Mulliken charges:
elementType: O O C C C C C C C C C C C H H H H H H H H H H H H H H H H H H H H H H
charge: -0.278132 -0.241334 -0.052413 -0.353758 -0.299876 -0.363662 -0.336813 -0.714954 -0.521878 -0.356028 -0.713956 0.255556 -0.694012 0.190707 0.193429 0.217752 0.236046 0.228096 0.209550 0.214280 0.184516 0.184307 0.230978 0.211721 0.208207 0.242043 0.240880 0.197297 0.197795 0.207860 0.222360 0.218052 0.209063 0.209238 0.217084
chargesum: 0.00000
title: Mulliken charges with hydrogens summed into heavy atoms:
elementType: O O C C C C C C C C C C C
charge: -0.278132 -0.241334 0.138294 0.057423 0.164266 0.060168 0.032011 -0.064049 -0.038955 0.039064 -0.065684 0.255556 -0.058627
polarizability: 1.56591205e+02 -1.02244393e-01 1.10475943e+02 1.57942961e+00 2.02391950e+00 1.13271115e+02
1716.lowfreq: -29.0866 -13.0326 -2.0614 -0.0007 0.0001 0.0006 6.3014 21.3816 28.5486
frequency: -27.8734 19.5146 27.1101 46.3719 54.7146 89.4848 97.3922 117.0402 126.3183 172.7067 191.8726 206.9059 227.8154 232.5609 241.7917 284.5236 291.0541 363.9988 390.1573 435.6142 465.0585 546.1344 553.9489 676.6779 721.0433 749.9907 769.7393 789.9228 836.6239 857.3642 883.3672 904.6201 919.2718 951.3824 953.5518 965.1372 1013.7254 1023.7576 1050.3623 1068.1111 1075.3651 1106.0303 1109.0458 1114.9781 1130.0545 1134.7124 1182.4490 1196.5363 1221.4573 1243.0831 1251.8342 1261.5135 1283.7389 1289.0820 1289.7326 1303.0712 1339.4510 1346.3478 1348.1673 1356.0849 1364.4480 1389.0460 1389.2087 1391.7161 1439.3585 1462.7154 1465.1238 1465.7791 1468.6250 1477.1957 1477.4409 1478.9839 1480.0625 1484.9014 1487.5695 1492.4250 1639.5406 2951.0688 2955.5495 2969.0391 2971.6015 2974.4804 2978.3032 2982.2677 2983.3728 2992.1212 2994.3707 3008.3553 3021.2540 3030.3958 3034.8903 3059.8184 3067.0678 3068.7081 3069.5622 3071.3650 3072.1911 3075.7296 3085.2886
redmass: 1.7926 2.9981 6.0119 3.2612 3.3034 2.2184 1.7036 2.1964 3.0192 2.8684 3.5539 1.0978 1.3952 1.1074 3.5506 3.1995 2.6207 2.0346 3.1896 2.4888 3.1853 2.6362 3.0374 4.7428 1.0848 1.1841 1.9187 1.4649 1.3009 3.7149 2.4880 1.9543 2.1115 1.7337 1.2405 1.3394 3.7752 1.5538 2.9933 2.7319 2.1985 1.6973 1.6554 2.0311 2.0812 2.8512 1.9668 1.5599 1.1498 1.3747 1.2538 1.2329 1.0524 1.1230 1.3197 1.4424 1.5932 1.4642 1.5862 1.4809 1.6636 1.2213 1.2236 1.2133 1.0860 1.0696 1.0662 1.0659 1.0741 1.0479 1.0435 1.0703 1.0589 1.0616 1.0851 1.0544 9.7384 1.0587 1.0808 1.0578 1.0376 1.0362 1.0390 1.0585 1.0613 1.0979 1.0604 1.0588 1.1011 1.1001 1.0995 1.1030 1.1041 1.1010 1.0995 1.0992 1.1011 1.1004 1.0996
irintensity: 0.0060 0.2140 1.0201 0.2968 0.3534 0.1542 0.8537 0.1317 0.7935 3.8484 1.5261 0.3587 0.0837 0.0789 7.6757 0.6710 7.3799 1.4788 2.0107 0.8251 5.1740 1.1673 0.6115 3.3723 13.4519 0.0176 10.1185 4.1514 5.1866 8.7558 22.9003 1.8610 3.6906 29.0344 0.1004 17.3890 37.9889 6.9871 5.4486 24.1383 20.5560 44.0603 10.2516 32.4015 59.3517 226.4805 2.4949 0.3388 4.2857 55.9738 0.6504 0.9930 0.0297 1.0316 0.2401 43.0318 0.4871 11.5249 0.8937 0.6710 18.3540 17.9748 6.8035 17.8599 22.2040 0.2093 4.1473 2.8163 0.9600 14.8830 13.0388 6.9239 14.5994 17.7343 21.2526 9.1485 176.2623 15.3212 22.3831 54.3154 31.9918 38.9862 19.2805 41.4410 5.3175 4.5451 40.5426 27.5163 14.9468 4.2696 9.7923 23.5910 11.5967 112.1359 56.0429 54.7636 71.9585 50.4400 51.2453
temp: 298.150 k
press: 1.00000 atm
elementType: 8 8 6 6 6 6 6 6 6 6 6 6 6 1 1 1 1 1 1 1 1 1 1 1 1 1 1 1 1 1 1 1 1 1 1
symmnumber: 1
zpe: 814479.9 jmol-1
zpe.correction: 0.310219 hartree
zpe.thermalcorrener: 0.326544 hartree
zpe.thermalcorrenthalpy: 0.327488 hartree
zpe.thermalcorrgfe: 0.263992 hartree
zpe.sumelectzpe: -581.744845 hartree
zpe.sumelectthermal: -581.728520 hartree
zpe.sumelectthermalent: -581.727576 hartree
zpe.sumelectthermalfe: -581.791072 hartree
dipole: 0.7605 0.8152 1.5716
dipole: 1.9269
quadrupole: -74.0970 -82.4624 -87.6064
quadrupole: -1.5383 -1.7979 -3.2038
quadrupole: 7.2916 -1.0738 -6.2178 -1.5383 -1.7979 -3.2038
hfenergy: -582.0550639 hartree
pointgroup: C01 [X(C11H22O2)]
dipole: -0.302861 -0.4675385 0.5141963 debye
polarizability: 156.6031807|0.1335126|111.663092|-1.4093746|-2.4439596|112.07199 unknown
InChI: InChI=1S/C11H22O2/c1-4-6-7-8-11(12)13-9-10(3)5-2/h10H,4-9H2,1-3H3
charge 0 multiplicity 1
35 atoms
O  -1.220185 0.206449 0.144204
O  0.072641 1.432136 -1.356829
C  -3.657067 0.327623 0.380277
C  -3.831546 -1.212301 0.277478
C  -2.450702 0.845657 -0.417487
C  2.530491 0.31653 -0.282304
C  3.689214 -0.462423 0.377452
C  -3.585281 0.781387 1.857855
C  1.151391 -0.143362 0.228144
C  5.080049 -0.005109 -0.118588
C  -4.07368 -1.737965 -1.154339
C  -0.005356 0.593984 -0.429128
C  6.239528 -0.784485 0.538456
H  -4.54606 0.803094 -0.090094
H  -4.687558 -1.500911 0.919719
H  -2.93474 -1.698256 0.707681
H  -2.509979 0.592953 -1.491349
H  -2.3420 1.942507 -0.328329
H  2.649662 1.400402 -0.090359
H  2.573325 0.196279 -1.381701
H  3.63929 -0.343069 1.48048
H  3.570749 -1.548206 0.176441
H  -2.703269 0.339645 2.354865
H  -4.487903 0.461715 2.410133
H  -3.507557 1.881803 1.940252
H  1.06749 -0.01047 1.324374
H  1.009204 -1.228024 0.049023
H  5.1994 1.078912 0.082848
H  5.130031 -0.122949 -1.220198
H  -4.947268 -1.243586 -1.620961
H  -3.19911 -1.566589 -1.808147
H  -4.26872 -2.825968 -1.14606
H  6.226858 -0.661778 1.638139
H  6.163471 -1.866892 0.321564
H  7.221886 -0.435033 0.170985
