program: Gaussian 09
title: 000102861
version: EM64L-G09RevD.01
frameworkgroup: C1[X(C13H22O3)]
method: RPBEPBE
basis: SDD
operation: Freq
keyword: #pfreq=noraman
keyword: PBEPBE/SDD
title: #p freq=noraman PBEPBE/SDD
converged: YES YES NO NO
title: Mulliken charges:
elementType: O O O C C C C C C C C C C C C C H H H H H H H H H H H H H H H H H H H H H H
charge: -0.183726 -0.265075 -0.243201 -0.095138 -0.141687 -0.489351 -0.454823 -0.530932 0.078159 -0.559447 -0.375494 -0.351449 0.246534 -0.359269 -0.697106 -0.504181 0.259144 0.238589 0.224615 0.227002 0.202562 0.233376 0.250327 0.258366 0.251632 0.241708 0.187090 0.224646 0.187988 0.187106 0.195940 0.200894 0.209966 0.215452 0.209256 0.243080 0.241590 0.235857
chargesum: 0.00000
title: Mulliken charges with hydrogens summed into heavy atoms:
elementType: O O O C C C C C C C C C C C C C
charge: -0.183726 -0.265075 -0.243201 0.164005 0.096902 -0.037734 -0.018886 -0.022239 0.078159 -0.066107 0.036243 0.023645 0.246534 0.037565 -0.062432 0.216345
polarizability: 1.59656919e+02 7.21505668e+00 1.51011768e+02 -9.60334259e-01 3.41305629e+00 1.26388691e+02
1716.lowfreq: -1.7646 -0.0002 0.0006 0.0008 3.0871 6.3951 12.6615 25.4439 38.2501
frequency: 1.7768 25.0972 38.1739 48.8349 61.8589 79.2122 91.3845 101.2787 116.1719 132.2028 157.0846 161.1017 194.7548 210.7840 222.4043 249.9481 269.8392 317.0863 337.1269 383.7801 424.1630 463.1639 499.6634 534.8021 575.5043 612.1323 635.6091 688.6613 722.6564 745.9022 799.0342 806.9112 821.9688 838.1741 866.2313 887.8006 904.8448 942.1590 951.3497 970.5486 1000.4401 1006.7078 1027.5292 1046.5570 1055.8750 1069.9804 1079.3000 1106.3183 1112.4944 1116.1026 1122.2505 1148.0331 1153.1714 1156.7558 1168.5807 1194.5134 1214.1233 1220.6600 1247.2424 1254.8293 1255.6050 1275.2644 1289.0906 1290.1491 1301.8269 1309.0208 1312.7284 1326.9715 1346.5770 1355.9793 1360.4419 1386.5403 1421.9197 1435.2875 1443.1156 1452.5499 1461.8045 1463.4746 1464.3352 1471.0625 1475.3185 1478.1689 1480.7438 1488.3571 1640.0953 1652.8116 2950.8490 2958.8064 2965.6745 2970.9112 2971.5327 2984.6038 2989.4539 2990.5343 2992.2931 3004.2631 3005.5420 3011.1240 3025.7503 3035.3010 3044.6384 3062.2013 3064.6392 3067.7905 3070.2713 3076.8955 3107.7492 3151.1674
redmass: 5.1677 4.5253 3.3459 3.4458 1.8228 4.1117 1.1471 2.9803 2.7583 1.7419 3.9082 2.8763 4.3880 2.5300 1.1680 2.6309 3.7250 2.8933 3.1098 3.4847 3.3381 3.3312 3.5336 2.3449 3.2744 4.7562 3.6971 3.7654 1.0807 1.1899 2.3185 2.0337 2.3514 3.4768 1.5577 2.1017 2.1996 2.6553 1.5269 2.6939 1.7383 2.9544 2.3757 1.6851 2.3033 2.5219 2.3659 1.9176 1.3334 2.1333 1.7630 1.4457 1.7198 3.0989 1.7497 1.5902 1.3569 1.4733 1.3435 1.3603 1.2887 1.4051 1.0596 1.2320 1.2669 1.3590 1.3219 1.5771 1.4458 1.5988 1.5219 1.2178 1.1898 1.0808 1.0873 1.0501 1.0752 1.0516 1.0713 1.0711 1.0440 1.0838 1.0790 1.0908 9.0420 12.0310 1.0591 1.0617 1.0603 1.0441 1.0522 1.0639 1.0708 1.0925 1.0812 1.0628 1.0297 1.0996 1.1026 1.0867 1.1031 1.0997 1.0962 1.1007 1.0992 1.0988 1.1046 1.1048
irintensity: 1.4515 2.8437 0.4175 0.9301 0.3359 3.4261 0.5564 0.7796 0.2515 0.0164 2.7383 2.5837 5.5365 0.1529 0.0012 6.3586 16.7980 1.1368 3.4201 2.6988 1.0735 3.1038 5.0115 1.1038 4.9229 0.7017 0.3317 10.5970 9.7625 0.9543 1.9601 15.4477 4.3421 1.6878 7.1638 6.3099 0.5591 18.6249 5.9192 9.6671 17.3777 4.6502 5.4987 2.3596 5.7025 1.2837 1.2305 40.3993 21.9609 111.4097 60.3275 3.6036 30.6591 69.2739 36.9121 18.8234 14.1369 10.1541 10.3017 6.5970 3.3568 12.4506 2.1422 2.0130 6.5041 4.0259 14.1463 16.2342 2.6382 2.1318 19.1661 11.4675 21.9619 18.6483 20.2958 14.3821 0.6407 12.8547 0.5322 1.8461 10.3607 13.1117 5.2485 23.7014 162.6501 176.7147 8.2463 0.3379 0.7407 109.3557 40.1876 13.5152 7.2520 1.2945 29.6100 30.0755 27.2297 2.2006 6.2075 4.1021 77.1580 23.4580 18.9587 96.4203 52.9572 26.0815 26.2643 15.8508
temp: 298.150 k
press: 1.00000 atm
elementType: 8 8 8 6 6 6 6 6 6 6 6 6 6 6 6 6 1 1 1 1 1 1 1 1 1 1 1 1 1 1 1 1 1 1 1 1 1 1
symmnumber: 1
zpe: 858523.2 jmol-1
zpe.correction: 0.326994 hartree
zpe.thermalcorrener: 0.345760 hartree
zpe.thermalcorrenthalpy: 0.346705 hartree
zpe.thermalcorrgfe: 0.274727 hartree
zpe.sumelectzpe: -732.978478 hartree
zpe.sumelectthermal: -732.959712 hartree
zpe.sumelectthermalent: -732.958768 hartree
zpe.sumelectthermalfe: -733.030745 hartree
dipole: -1.3763 1.7746 -2.0254
dipole: 3.0242
quadrupole: -94.0951 -97.9298 -102.2614
quadrupole: -5.2221 4.6392 14.8097
quadrupole: 4.0003 0.1657 -4.1660 -5.2221 4.6392 14.8097
hfenergy: -733.3054724 hartree
pointgroup: C01 [X(C13H22O3)]
dipole: 0.5518965 0.6704133 0.8133652 debye
polarizability: 158.8867664|-7.5268875|151.7972726|-0.0392132|-3.6942606|126.3733399 unknown
InChI: InChI=1S/C13H22O3/c1-3-4-5-6-11-10(7-8-12(11)14)9-13(15)16-2/h10-11H,3-9H2,1-2H3
charge 0 multiplicity 1
38 atoms
O  0.955518 -2.914359 -1.835157
O  2.708548 2.32638 -0.408904
O  0.721587 2.328729 0.804525
C  1.0127 -0.622253 1.031251
C  0.379701 -1.018226 -0.336209
C  1.46882 -1.984696 1.648655
C  -1.163729 -1.236271 -0.280611
C  1.940748 -2.832872 0.444267
C  1.086036 -2.333258 -0.730661
C  2.209119 0.348914 0.865749
C  -1.959448 0.088108 -0.253103
C  -3.480825 -0.136379 -0.103539
C  1.767949 1.741586 0.443553
C  -4.293097 1.17882 -0.124226
C  -5.812006 0.952187 0.034964
C  2.407717 3.713158 -0.846492
H  0.266686 -0.126727 1.677654
H  0.576985 -0.265335 -1.125764
H  2.251154 -1.855055 2.417166
H  0.607577 -2.477325 2.13727
H  -1.418303 -1.843929 0.612786
H  -1.463935 -1.829177 -1.166904
H  3.005603 -2.642463 0.200647
H  1.833985 -3.923636 0.570741
H  2.953637 -0.024748 0.140784
H  2.732117 0.457055 1.837852
H  -1.760857 0.644977 -1.192601
H  -1.596431 0.737291 0.568395
H  -3.839198 -0.80033 -0.918175
H  -3.682412 -0.67462 0.846719
H  -4.09569 1.712511 -1.076371
H  -3.9288 1.844307 0.684603
H  -6.204603 0.310888 -0.776831
H  -6.368536 1.907244 0.01009
H  -6.040479 0.453166 0.995765
H  1.45694 3.738096 -1.40474
H  2.33125 4.381328 0.027656
H  3.253574 3.993313 -1.489304
