program: Gaussian 09
title: 000102845
version: EM64L-G09RevD.01
frameworkgroup: C1[X(C10H18O)]
method: RPBEPBE
basis: SDD
operation: Freq
keyword: #pfreq=noraman
keyword: PBEPBE/SDD
title: #p freq=noraman PBEPBE/SDD
converged: YES YES NO NO
title: Mulliken charges:
elementType: O C C C C C C C C C C H H H H H H H H H H H H H H H H H H
charge: -0.219274 -0.108547 -0.507447 -0.386786 0.206801 -0.313523 -0.710834 0.373891 -0.793869 -0.785417 -0.798261 0.213035 0.208876 0.229530 0.230614 0.200165 0.229443 0.205730 0.220216 0.229495 0.250490 0.253099 0.235845 0.230559 0.214493 0.219041 0.222602 0.230006 0.220027
chargesum: 0.00000
title: Mulliken charges with hydrogens summed into heavy atoms:
elementType: O C C C C C C C C C C
charge: -0.219274 0.104488 -0.069041 0.043993 0.206801 -0.084080 -0.055394 0.373891 -0.054434 -0.121325 -0.125626
polarizability: 1.36120434e+02 1.35092761e+00 1.04857844e+02 -1.00735333e+01 -1.53059996e+00 9.51057599e+01
1716.lowfreq: -12.1032 -3.1153 -0.0006 0.0006 0.0006 4.0206 29.3286 42.2507 46.7195
frequency: 29.1288 42.0856 46.6495 77.7090 90.5270 125.1141 154.8072 161.8111 178.4556 207.3848 224.0659 271.4707 308.0066 309.6455 381.0290 403.3978 404.2583 470.9875 540.6746 575.3351 601.2325 706.7223 764.4214 810.3613 852.3721 902.2907 931.3390 947.2459 951.4959 974.7576 995.8263 1002.8969 1038.2098 1062.8639 1082.2875 1095.8918 1110.7143 1126.4491 1161.2666 1178.2776 1233.7356 1250.2437 1263.9678 1295.0082 1329.5070 1348.3257 1361.2887 1365.6179 1389.1071 1389.3772 1399.5714 1442.7627 1448.7656 1453.2661 1456.1572 1460.7985 1470.4149 1473.8367 1478.2017 1480.9984 1484.3646 1629.2032 1691.5044 2957.9150 2964.6106 2971.8814 2972.9814 2979.6948 2982.4760 2992.1373 3028.9907 3032.3655 3036.5002 3045.8237 3054.8693 3070.6818 3074.2173 3075.5069 3081.4824 3094.8508 3116.5545
redmass: 3.0746 4.0631 3.1685 2.7601 2.2130 1.0556 1.3337 1.8374 1.2866 1.5613 2.0943 1.7799 2.2798 2.8533 2.4810 2.6070 2.7811 2.4123 2.6282 3.2075 2.3206 2.1654 2.1964 1.5389 1.4256 1.8734 1.7048 1.4191 1.8926 2.4295 1.2717 1.7525 2.1939 1.9325 1.6738 1.9343 2.2001 2.1548 1.4602 2.4676 1.7715 1.4069 1.1833 1.2672 1.4058 1.4515 1.2594 1.4725 1.3225 1.2162 1.2335 1.0724 1.0533 1.0821 1.0532 1.0769 1.0597 1.0574 1.0484 1.0814 1.0481 7.0874 6.3724 1.0373 1.0387 1.0372 1.0359 1.0613 1.0635 1.0790 1.0969 1.0963 1.1001 1.0998 1.0958 1.0999 1.0996 1.0950 1.0944 1.0957 1.1005
irintensity: 1.8488 3.5551 2.8329 0.3849 0.1150 0.1959 0.7709 0.0283 1.6912 2.5423 0.5625 3.6096 0.6152 1.0759 0.5452 5.1366 2.8410 1.3348 6.6701 5.1158 0.0863 7.6559 0.5146 4.6744 16.5280 8.1238 2.7139 2.4501 2.0326 6.2587 8.7701 0.4070 6.4771 12.7802 3.0651 5.5911 6.2748 4.8821 5.3279 66.0908 4.3210 7.8371 4.9243 5.5893 3.7912 9.0012 43.1022 35.6876 25.4813 15.2006 10.2164 17.1310 16.2358 0.2900 1.0477 6.7495 28.9160 15.9956 10.1078 11.2526 12.2519 97.5201 5.8097 37.0003 50.5324 1.6607 32.8795 2.7104 34.2063 42.5021 3.6584 50.0074 0.4189 11.2445 8.2413 55.5099 40.2115 8.0140 60.6514 36.3354 17.0934
temp: 298.150 k
press: 1.00000 atm
elementType: 8 6 6 6 6 6 6 6 6 6 6 1 1 1 1 1 1 1 1 1 1 1 1 1 1 1 1 1 1
symmnumber: 1
zpe: 666493.6 jmol-1
zpe.correction: 0.253854 hartree
zpe.thermalcorrener: 0.268411 hartree
zpe.thermalcorrenthalpy: 0.269355 hartree
zpe.thermalcorrgfe: 0.211304 hartree
zpe.sumelectzpe: -466.177581 hartree
zpe.sumelectthermal: -466.163023 hartree
zpe.sumelectthermalent: -466.162079 hartree
zpe.sumelectthermalfe: -466.220131 hartree
dipole: -1.8598 -1.4597 2.5085
dipole: 3.4471
quadrupole: -69.8684 -69.2912 -71.6365
quadrupole: -3.7590 3.2843 3.8112
quadrupole: 0.3970 0.9742 -1.3712 -3.7590 3.2843 3.8112
hfenergy: -466.4314347 hartree
pointgroup: C01 [X(C10H18O1)]
dipole: -0.7155088 0.5914199 -0.9886948 debye
polarizability: 135.7742448|-1.4948435|104.9078564|10.7291595|-1.3785823|95.4019374 unknown
InChI: InChI=1S/C10H18O/c1-5-10(9(4)11)7-6-8(2)3/h6,10H,5,7H2,1-4H3
charge 0 multiplicity 1
29 atoms
O  1.986006 -1.496134 1.044615
C  1.006045 0.430123 -0.085102
C  -0.214816 0.670425 0.875017
C  2.185885 1.363544 0.297963
C  1.431114 -1.047823 0.003581
C  -1.429259 -0.184228 0.571388
C  3.364021 1.309537 -0.698542
C  -2.577459 0.193013 -0.064354
C  1.132703 -1.934677 -1.194664
C  -3.712747 -0.796882 -0.276094
C  -2.844785 1.587053 -0.605292
H  0.67953 0.64696 -1.121876
H  -0.463036 1.747265 0.833753
H  0.137164 0.456818 1.90387
H  2.537206 1.074984 1.307232
H  1.80424 2.401712 0.367717
H  -1.362974 -1.228166 0.916514
H  3.039183 1.579064 -1.721688
H  4.163255 2.013495 -0.403397
H  3.811008 0.298871 -0.735262
H  1.420805 -2.978462 -0.993119
H  0.054521 -1.878681 -1.439993
H  1.679948 -1.56363 -2.0831
H  -3.469412 -1.79415 0.129868
H  -3.948941 -0.910204 -1.353194
H  -4.64215 -0.444933 0.21461
H  -3.753385 2.018119 -0.139752
H  -2.010446 2.286435 -0.43474
H  -3.038626 1.549851 -1.695958
