program: Gaussian 09
title: 000102844
version: EM64L-G09RevD.01
frameworkgroup: C1[X(C10H18O)]
method: RPBEPBE
basis: SDD
operation: Freq
keyword: #pfreq=noraman
keyword: PBEPBE/SDD
title: #p freq=noraman PBEPBE/SDD
converged: YES YES NO NO
title: Mulliken charges:
elementType: O C C C C C C C C C C H H H H H H H H H H H H H H H H H H
charge: -0.229917 -0.146256 -0.483556 0.256777 -0.725545 -0.496539 -0.326841 0.380790 -0.674380 -0.787445 -0.796249 0.210829 0.204850 0.233448 0.217160 0.220389 0.240399 0.241072 0.227658 0.216830 0.209072 0.232542 0.226118 0.225089 0.217466 0.217765 0.215512 0.255071 0.217891
chargesum: 0.00000
title: Mulliken charges with hydrogens summed into heavy atoms:
elementType: O C C C C C C C C C C
charge: -0.229917 0.064573 -0.045258 0.256777 -0.047597 -0.027809 -0.110012 0.380790 -0.006648 -0.127125 -0.107775
polarizability: 1.18077641e+02 1.22465958e+01 1.11821247e+02 4.90713384e+00 3.97187403e+00 1.00837029e+02
1716.lowfreq: -13.4849 0.0003 0.0003 0.0004 1.8966 8.8136 15.9605 35.7651 54.8404
frequency: 11.9477 34.7526 54.5814 78.5082 95.9685 108.1431 159.6573 179.4602 187.6610 217.0282 222.3228 246.0519 292.1935 321.3373 339.1533 404.9854 420.6650 465.7360 534.8335 555.1237 616.1507 744.9055 778.7224 795.8377 838.5539 891.7652 920.2494 951.0289 979.6061 991.8413 1004.8547 1023.3020 1030.2258 1054.4696 1083.2449 1088.6885 1102.7194 1116.3680 1130.1644 1176.2316 1236.5885 1237.8005 1271.8790 1309.7984 1315.1644 1346.8921 1357.1550 1382.8327 1388.9392 1394.4647 1400.3110 1426.9838 1453.2893 1454.8700 1467.5006 1469.8776 1470.7140 1471.4795 1478.4533 1479.6527 1484.3870 1628.4818 1691.3533 2955.5901 2957.7519 2964.9381 2972.9126 2978.7105 2988.9568 2996.0577 2998.8670 3029.5735 3033.9561 3051.2252 3068.9329 3073.7523 3078.1578 3087.6220 3092.4131 3098.0413 3102.5578
redmass: 3.7432 2.5955 3.4541 1.8886 1.5535 1.4494 1.3956 1.3899 1.7964 2.1390 1.1949 2.6463 3.3602 2.4714 2.7284 2.5910 2.8935 2.3103 2.4878 2.0179 3.1082 2.3758 2.6518 1.5159 1.6074 1.7759 1.7212 1.3777 2.4251 1.2527 1.6614 1.9642 1.8799 1.7225 1.6754 2.0645 1.9784 1.9951 2.2185 1.6464 1.6822 1.2862 1.3013 1.3482 1.4929 1.8125 1.4487 1.2206 1.2821 1.2113 1.2295 1.0944 1.0612 1.0683 1.0513 1.0409 1.0605 1.0517 1.0503 1.0587 1.0753 7.4455 6.3942 1.0612 1.0371 1.0397 1.0650 1.0368 1.0818 1.0386 1.0939 1.0968 1.0959 1.0917 1.0939 1.0998 1.0971 1.1002 1.1004 1.0997 1.0961
irintensity: 1.8984 0.5835 5.6739 0.1914 0.5481 0.2569 0.8323 0.9625 0.8545 0.0426 0.3129 0.3474 7.8092 5.6787 0.7210 4.8759 0.4392 2.5318 3.0956 0.2540 1.1396 4.4128 1.7561 11.6106 14.8953 9.2290 2.4480 0.5206 32.6724 6.3544 0.7290 3.3119 7.0836 15.5580 5.3800 12.5894 8.4298 22.8935 8.2099 12.2535 5.2759 0.9200 0.6059 0.2009 12.0704 28.8869 3.1099 19.9638 22.3062 19.1394 17.7253 23.5953 3.6297 1.0263 15.9525 8.7276 16.2270 32.6643 9.6524 20.4321 7.0689 61.1141 5.7696 21.4101 35.5390 53.9828 34.9367 39.6943 20.7256 24.7701 11.7575 9.6649 44.9696 2.6737 16.6801 35.2892 46.0238 30.9357 30.5275 30.6232 20.2101
temp: 298.150 k
press: 1.00000 atm
elementType: 8 6 6 6 6 6 6 6 6 6 6 1 1 1 1 1 1 1 1 1 1 1 1 1 1 1 1 1 1
symmnumber: 1
zpe: 666307.6 jmol-1
zpe.correction: 0.253783 hartree
zpe.thermalcorrener: 0.268401 hartree
zpe.thermalcorrenthalpy: 0.269345 hartree
zpe.thermalcorrgfe: 0.210441 hartree
zpe.sumelectzpe: -466.179377 hartree
zpe.sumelectthermal: -466.164759 hartree
zpe.sumelectthermalent: -466.163815 hartree
zpe.sumelectthermalfe: -466.222719 hartree
dipole: 0.1180 -0.2387 -2.4881
dipole: 2.5024
quadrupole: -66.6613 -67.3107 -71.6481
quadrupole: 2.2779 4.5128 -0.9973
quadrupole: 1.8788 1.2293 -3.1081 2.2779 4.5128 -0.9973
hfenergy: -466.43316 hartree
pointgroup: C01 [X(C10H18O1)]
dipole: 0.0187362 -0.0243319 -0.9840225 debye
polarizability: 118.0811125|12.0875989|111.5181374|5.2199246|4.4335014|101.1366676 unknown
InChI: InChI=1S/C10H18O/c1-5-10(11)9(4)7-6-8(2)3/h6,9H,5,7H2,1-4H3
charge 0 multiplicity 1
29 atoms
O  -1.261647 0.245278 1.45645
C  -1.055993 -1.171579 -0.51699
C  0.396916 -1.626925 -0.16836
C  -1.37271 0.15398 0.203259
C  -2.091956 -2.244863 -0.089648
C  -1.81633 1.331038 -0.661338
C  1.464686 -0.72682 -0.759023
C  2.31544 0.109156 -0.093732
C  -2.209292 2.588492 0.130809
C  3.348563 0.929421 -0.851748
C  2.335532 0.29824 1.413528
H  -1.129802 -1.00857 -1.610879
H  0.527116 -2.656446 -0.561015
H  0.478071 -1.687889 0.931245
H  -3.124312 -1.947602 -0.351273
H  -1.876193 -3.206544 -0.59002
H  -2.047053 -2.399275 1.003083
H  -0.976363 1.543201 -1.357752
H  -2.647071 0.986002 -1.312741
H  1.551462 -0.770671 -1.857225
H  -2.490199 3.410958 -0.550901
H  -1.372727 2.926076 0.766119
H  -3.061096 2.381527 0.801601
H  3.309461 0.740791 -1.938934
H  3.197198 2.014251 -0.682424
H  4.373524 0.696727 -0.499541
H  2.31671 1.376514 1.666191
H  1.480137 -0.174222 1.920945
H  3.271129 -0.111246 1.845113
