program: Gaussian 09
title: 000102863
version: EM64L-G09RevD.01
frameworkgroup: C1[X(C9F18O3)]
method: RPBEPBE
basis: SDD
operation: Freq
keyword: #pfreq=noraman
keyword: PBEPBE/SDD
title: #p freq=noraman PBEPBE/SDD
converged: YES YES NO NO
title: Mulliken charges:
elementType: F F F F F F F F F F F F F F F F F F O O O C C C C C C C C C
charge: -0.103959 -0.105427 -0.128909 -0.118149 -0.116182 -0.118997 -0.116399 -0.112842 -0.121442 -0.123191 -0.115624 -0.123182 -0.129091 -0.121918 -0.109033 -0.122818 -0.120677 -0.129518 -0.272400 -0.248368 -0.092458 0.185082 0.369024 0.360663 0.387534 0.203981 0.216627 0.393969 0.373987 0.259719
chargesum: 0.00000
title: Mulliken charges with hydrogens summed into heavy atoms:
polarizability: 1.37011523e+02 3.06361315e-01 1.09361414e+02 -5.92967829e+00 1.63680893e-01 1.06873287e+02
1716.lowfreq: -6.5542 -2.6455 -0.0003 0.0002 0.0005 3.5756 7.8182 15.8816 22.0393
frequency: 7.7599 15.8240 22.0075 25.2502 32.2921 35.0320 38.0278 46.9700 53.2538 63.0511 77.0745 87.1618 115.9294 137.3150 142.0172 163.1539 172.9448 192.4740 199.3404 206.6151 208.2748 217.1609 226.6623 238.8491 248.5068 267.2954 273.0502 281.7182 288.4072 298.1451 302.2676 311.9817 321.3005 331.7849 332.6610 393.9969 404.3189 441.7222 453.4054 460.7436 465.7154 474.5735 480.0190 486.6262 503.5709 514.8613 523.2464 549.2623 568.2248 574.9828 606.0231 626.8144 647.9672 660.5508 669.5446 692.8439 708.1587 730.9679 887.9352 896.9823 913.1747 976.5782 986.9675 989.7317 994.6172 1009.8374 1022.8078 1035.3547 1042.6082 1044.4372 1054.4961 1066.6619 1070.9073 1077.2424 1085.2140 1089.1450 1101.3473 1120.1604 1172.7732 1184.2897 1195.2128 1202.3038 1221.4305 1769.8650
redmass: 18.0791 18.1237 17.9670 17.8217 18.1920 17.8371 18.4776 17.9970 17.8565 18.0167 18.2010 17.4156 17.2973 17.4358 17.7988 17.6832 17.5922 18.1707 18.1015 18.0113 18.4604 17.9300 18.3473 18.1141 18.3107 18.5166 18.5167 18.5354 18.1839 18.4250 18.5911 18.3653 17.9457 18.0357 17.6930 17.5816 17.6113 16.8963 17.3320 17.7193 17.4976 17.1625 17.1697 17.2497 17.1742 17.4225 15.8857 16.7958 17.1215 17.0397 15.8864 16.1461 16.2916 15.6846 16.9134 16.3486 16.9718 15.7288 13.9173 13.9028 13.6389 13.0500 13.0488 12.9560 13.1970 13.1275 13.0521 13.0473 13.2067 13.2603 13.0872 13.2624 13.0551 13.0946 13.1570 13.0053 12.9159 12.6965 12.5149 12.5463 12.4494 12.2609 12.2629 13.2594
irintensity: 0.0871 0.0011 0.0344 0.0413 0.0554 0.0286 0.0248 0.0409 0.0906 0.1165 0.0707 0.1093 2.3193 0.6745 1.6583 0.9302 0.4551 0.5643 4.1898 1.2956 1.6026 0.8300 1.4850 2.2647 1.3613 1.3557 6.0822 1.4049 0.5558 0.6932 0.2943 0.0741 1.1325 1.5793 0.0313 10.4284 5.3657 0.8298 38.0265 6.4711 3.7496 11.6179 13.1046 7.2473 3.1570 4.5501 26.5237 9.5361 23.0711 9.0738 21.6435 19.2202 60.5509 3.6237 9.5891 5.3433 18.3601 11.4184 46.3735 202.0717 128.4012 90.9436 15.0524 151.5509 81.8347 28.8046 223.0601 51.3423 119.2790 76.7572 96.2468 335.4277 85.2424 115.3663 441.3453 209.7201 1021.9501 328.6578 47.4745 75.0745 54.7762 27.3893 70.1239 154.7438
temp: 298.150 k
press: 1.00000 atm
elementType: 9 9 9 9 9 9 9 9 9 9 9 9 9 9 9 9 9 9 8 8 8 6 6 6 6 6 6 6 6 6
symmnumber: 1
zpe: 280116.3 jmol-1
zpe.correction: 0.106691 hartree
zpe.thermalcorrener: 0.136846 hartree
zpe.thermalcorrenthalpy: 0.137790 hartree
zpe.thermalcorrgfe: 0.039717 hartree
zpe.sumelectzpe: -2363.394975 hartree
zpe.sumelectthermal: -2363.364820 hartree
zpe.sumelectthermalent: -2363.363876 hartree
zpe.sumelectthermalfe: -2363.461949 hartree
dipole: -0.8303 -0.0678 -0.1499
dipole: 0.8465
quadrupole: -167.7561 -170.8101 -169.6933
quadrupole: 0.8414 1.3663 -0.8490
quadrupole: 1.6637 -1.3902 -0.2734 0.8414 1.3663 -0.8490
hfenergy: -2363.5016659 hartree
pointgroup: C01 [X(C9F18O3)]
dipole: -0.3260778 0.0323937 0.0594804 debye
polarizability: 137.1344121|0.3002353|109.3691324|5.6075285|-0.0907102|106.7426795 unknown
InChI: InChI=1S/C9F18O3/c10-1(28)2(11,5(15,16)17)29-9(26,27)4(14,7(21,22)23)30-8(24,25)3(12,13)6(18,19)20
charge 0 multiplicity 1
30 atoms
F  0.214529 0.326053 2.061401
F  -0.529634 1.937202 -0.075112
F  -0.685518 0.17663 -1.489937
F  2.209311 2.106637 1.100681
F  3.04953 0.175933 1.930886
F  0.08885 -2.326753 -0.43749
F  1.263224 -2.271142 1.504832
F  -0.995747 -2.11345 1.548447
F  3.400496 1.764489 -1.332395
F  4.884186 1.46368 0.380263
F  -3.267281 1.766062 -0.959477
F  3.333903 -0.912161 -1.891167
F  4.402821 -1.454241 0.038721
F  5.482583 -0.274225 -1.572869
F  -4.313063 1.40023 1.616983
F  -5.650604 0.548253 -0.009182
F  -4.433756 -0.847504 1.30825
F  -4.151781 -0.107393 -2.565411
O  1.567949 0.076975 0.114451
O  -2.065115 0.250083 0.406185
O  -2.998974 -1.767085 -1.440574
C  0.295243 -0.186779 0.740552
C  -0.793582 0.552017 -0.123541
C  2.604397 0.799595 0.743441
C  0.14815 -1.753531 0.836058
C  3.783994 0.893943 -0.291684
C  -3.255687 0.468377 -0.378868
C  4.251362 -0.461853 -0.939224
C  -4.429081 0.394274 0.663281
C  -3.410405 -0.624017 -1.487601
