program: Gaussian 09
title: 000149590
version: EM64L-G09RevD.01
frameworkgroup: C1[X(C20H24N4O5)]
method: RPBEPBE
basis: SDD
operation: Freq
keyword: #p
keyword: freq=noraman
keyword: PBEPBE/SDD
title: #p freq=noraman PBEPBE/SDD
converged: YES YES NO NO
title: Mulliken charges:
elementType: O O O O O N N N N C C C C C C C C C C C C C C C C C C C C H H H H H H H H H H H H H H H H H H H H H H H H
charge: -0.480438 -0.462110 -0.452212 -0.207931 -0.264741 -0.459237 -0.356388 -0.055912 0.004596 0.305577 -0.371409 -0.427291 -0.413451 -0.358898 -0.432473 -0.390889 0.307069 0.173456 0.223186 -0.076816 -0.072706 0.269364 -0.358742 -0.316281 -0.312848 -0.382833 -0.220851 -0.279145 -0.226735 0.283013 0.208000 0.222791 0.230461 0.243078 0.221576 0.201275 0.241587 0.180837 0.243971 0.194675 0.239068 0.264952 0.292651 0.367322 0.349679 0.356829 0.203727 0.278889 0.268468 0.288033 0.246865 0.232759 0.236583
chargesum: 0.00000
title: Mulliken charges with hydrogens summed into heavy atoms:
elementType: O O O O O N N N N C C C C C C C C C C C C C C C C C C C C
charge: -0.113115 -0.112431 -0.095382 -0.207931 -0.264741 -0.176224 -0.063737 -0.055912 0.004596 0.305577 0.059381 0.046248 0.009400 0.063526 0.006173 0.113131 0.307069 0.173456 0.223186 -0.076816 -0.072706 0.269364 -0.155015 -0.037392 -0.044380 -0.094799 0.026014 -0.046386 0.009848
polarizability: 4.62443660e+02 -2.98228793e+01 3.18784587e+02 2.38829544e+01 2.37189906e+01 1.65084264e+02
1716.lowfreq: -7.8939 -5.1679 -0.0003 0.0004 0.0005 3.0979 17.8000 22.3023 43.4161
frequency: 17.7893 22.2688 43.3664 50.2825 61.7825 70.2222 81.3585 87.4123 108.3732 117.4759 123.9602 131.8870 136.4198 152.6721 173.6984 182.5833 203.2002 216.6288 218.3723 240.5185 251.1934 258.9659 273.6118 279.5611 293.0831 307.4180 335.5759 345.4284 366.8311 369.9382 379.3159 416.8017 432.1992 454.4430 483.3022 492.2127 502.6344 531.9874 533.4756 560.6456 580.0198 589.5101 602.9775 607.7030 626.5026 633.6455 641.4134 652.1242 654.8156 673.3118 695.5589 719.2028 724.4080 761.4618 773.9206 779.3212 789.9070 806.7277 820.1288 834.2907 862.9388 870.8236 888.7553 914.3600 917.2667 940.6365 946.4760 952.1905 961.5750 967.0216 981.1274 984.0759 992.2216 993.7692 998.5624 1028.6514 1036.1003 1070.1560 1077.8871 1093.1571 1099.5910 1117.0638 1120.1290 1137.0390 1139.4488 1146.9963 1158.2631 1171.7379 1180.6637 1189.5377 1196.9839 1201.9493 1221.6047 1238.6872 1242.6729 1257.9369 1264.5480 1274.2165 1283.0670 1290.6578 1296.8707 1312.5259 1328.8211 1334.0068 1348.5786 1362.3442 1366.3706 1369.0806 1371.9925 1399.4813 1399.7200 1401.5720 1426.9808 1428.1819 1445.4746 1451.5741 1463.4405 1466.5778 1470.5317 1478.2503 1489.9950 1493.7068 1498.8585 1521.9860 1522.8812 1551.3138 1556.3059 1594.2539 1619.5637 2915.4131 2944.4590 2947.7452 2957.0260 2979.8881 3003.4954 3005.2653 3009.4719 3045.1112 3076.5449 3093.4686 3105.0182 3139.1628 3139.5133 3155.4059 3157.7357 3173.4151 3175.0984 3189.0830 3276.6020 3404.7684 3436.9777 3520.4610 3583.6655
redmass: 6.2102 5.6265 6.0070 6.1578 5.3798 5.3883 5.7287 7.2298 4.1600 5.6214 4.5510 4.4544 3.9420 3.8990 5.2268 6.2559 2.1569 2.6926 3.8418 1.3566 3.6649 2.4705 3.4697 3.6542 4.5370 4.3748 5.2707 2.3715 6.8496 3.5248 5.5414 4.9333 3.9945 4.2695 3.6228 3.8968 4.0955 4.2813 3.5113 3.3943 4.3017 2.1389 1.7700 2.9298 3.2262 2.9840 4.2114 3.1423 1.3009 7.8633 6.0591 3.1224 1.6851 1.4215 3.6566 2.6326 2.4380 1.5211 1.8048 5.2171 1.6119 2.3638 2.3115 1.6907 2.9892 1.4199 3.0805 1.6800 2.4609 3.3282 3.9267 4.5538 1.3371 1.3596 3.0726 2.1588 3.3315 2.2589 1.9734 2.2855 1.7495 2.2185 1.8490 2.7545 2.3682 1.6032 1.2959 1.3427 1.2132 3.3310 1.5255 1.6305 1.4455 1.8638 1.5950 1.4066 1.3546 2.2922 1.1834 2.0380 1.5039 1.5952 3.9145 3.6447 1.3886 1.2020 1.4491 1.4257 2.2870 2.0943 2.1994 1.2667 3.1180 2.5873 2.6634 1.1753 1.0759 2.6355 1.0776 1.1334 1.0836 1.0904 1.1550 5.1081 6.3562 6.7321 2.0743 5.7487 6.2581 1.0676 1.0599 1.0653 1.0736 1.0613 1.0876 1.0806 1.0929 1.0996 1.0930 1.1041 1.0878 1.0877 1.0879 1.0874 1.0939 1.0996 1.0945 1.0968 1.0637 1.0733 1.0676 1.0742 1.0669
irintensity: 0.9453 1.7427 1.4527 1.0599 0.7426 3.0386 3.6255 3.9387 0.5651 1.5069 4.4809 3.0019 9.3176 5.2401 2.2084 1.7334 53.2474 7.6604 3.6484 85.4191 3.0137 4.1401 3.7873 5.2509 3.0262 1.2362 3.4697 2.4679 2.0060 24.5064 17.7468 2.7169 4.5064 3.0381 1.7620 3.1617 0.9200 6.9976 8.2811 9.7032 12.7160 22.0359 63.5195 10.5376 18.6797 6.9059 26.3921 25.1747 154.0110 15.6800 4.0117 7.2171 87.4868 85.9171 6.5140 38.9307 4.4685 91.1396 49.9822 1.3305 6.1136 10.3326 5.5693 36.3482 26.8465 0.3995 13.1829 2.6255 10.4675 42.9849 39.8003 55.1310 0.1090 2.3289 63.3414 8.3863 2.3593 4.6499 10.1907 19.9249 14.3003 14.8225 13.3435 45.1607 26.3030 15.8730 6.8191 1.7684 7.9090 359.5475 17.6059 35.5014 94.3512 1.8634 2.9574 20.5496 4.4269 6.7990 18.2305 18.1208 10.4853 14.4531 26.9474 73.0566 5.8009 21.6229 20.8831 38.2353 23.9406 20.9773 9.8577 16.3919 21.1473 24.6732 11.6471 17.8335 13.7962 4.1942 5.6751 7.0296 7.8291 7.7919 53.4709 122.5845 82.7803 93.2995 113.8221 6.7523 14.6077 61.2703 40.3939 111.2003 28.7756 39.1844 40.6340 22.6252 23.4976 29.9096 27.7354 33.0416 6.4373 10.1177 9.8735 4.1877 16.5279 29.9235 8.9091 2.8234 100.2678 27.5241 425.5158 24.7921 3.0025
temp: 298.150 k
press: 1.00000 atm
elementType: 8 8 8 8 8 7 7 7 7 6 6 6 6 6 6 6 6 6 6 6 6 6 6 6 6 6 6 6 6 1 1 1 1 1 1 1 1 1 1 1 1 1 1 1 1 1 1 1 1 1 1 1 1
symmnumber: 1
zpe: 1105902.3 jmol-1
zpe.correction: 0.421216 hartree
zpe.thermalcorrener: 0.448364 hartree
zpe.thermalcorrenthalpy: 0.449308 hartree
zpe.thermalcorrgfe: 0.363322 hartree
zpe.sumelectzpe: -1369.391822 hartree
zpe.sumelectthermal: -1369.364674 hartree
zpe.sumelectthermalent: -1369.363730 hartree
zpe.sumelectthermalfe: -1369.449716 hartree
dipole: 2.5459 -4.8607 0.1306
dipole: 5.4886
quadrupole: -166.0327 -142.1301 -190.7743
quadrupole: 8.5816 3.1778 1.0711
quadrupole: 0.2797 24.1822 -24.4619 8.5816 3.1778 1.0711
hfenergy: -1369.8130384 hartree
pointgroup: C01 [X(C20H24N4O5)]
dipole: 0.77425 1.7727636 0.9595992 debye
polarizability: 444.6987764|70.5592527|269.0381847|-23.7243095|75.7050564|232.5755491 unknown
InChI: InChI=1S/C20H24N4O5/c25-11-20(12-26,13-27)22-10-4-9-21-19-14-5-1-2-6-15(14)23-16-7-3-8-17(18(16)19)24(28)29/h1-3,5-8,21-22,25-27H,4,9-13H2
charge 0 multiplicity 1
53 atoms
O  -3.989461 -2.30932 1.167657
O  -7.112299 -0.186136 0.400692
O  -3.722305 0.273448 -2.147372
O  -0.014892 -0.984055 1.546887
O  -1.319992 -2.254066 0.167905
N  -3.371175 0.276533 0.521341
N  0.718441 1.593665 0.530185
N  4.125429 0.028764 -1.415011
N  -0.257478 -1.524616 0.397173
C  -4.711298 -0.182173 0.061771
C  -3.129867 1.694574 0.869448
C  -4.622898 -1.738711 -0.029861
C  -5.843125 0.216555 1.033646
C  -4.952312 0.401194 -1.36204
C  -1.641823 1.871178 1.244239
C  -0.684887 1.5617 0.072863
C  1.806611 0.87052 0.108673
C  1.767863 -0.364481 -0.644171
C  3.127084 1.424668 0.380953
C  2.936527 -0.640366 -1.4890
C  4.247167 0.97193 -0.422071
C  0.715305 -1.357794 -0.69699
C  3.362191 2.427771 1.377004
C  2.855699 -1.670336 -2.493339
C  5.539494 1.564911 -0.215406
C  0.680157 -2.368928 -1.668305
C  1.73444 -2.486958 -2.615653
C  4.6353 2.970018 1.571816
C  5.733136 2.542041 0.758811
H  -3.030003 -0.365714 1.253377
H  -3.746083 2.054153 1.724333
H  -3.386292 2.327404 -0.002636
H  -4.06399 -2.013582 -0.944775
H  -5.645792 -2.145594 -0.078912
H  -5.688377 -0.310603 1.998786
H  -5.837922 1.313966 1.20519
H  -5.754204 -0.153358 -1.875865
H  -5.261226 1.466782 -1.292459
H  -1.393316 1.193982 2.084253
H  -1.483533 2.910332 1.598548
H  -0.818618 2.314751 -0.733375
H  -0.936296 0.588077 -0.363478
H  0.945032 2.441591 1.054851
H  -3.023137 -2.468608 0.980291
H  -7.852361 -0.088572 1.049012
H  -3.00803 0.198468 -1.440969
H  2.55821 2.745558 2.053677
H  3.734922 -1.788962 -3.133538
H  6.356519 1.204803 -0.847648
H  -0.137109 -3.093438 -1.636756
H  1.689243 -3.266277 -3.381911
H  4.797155 3.714999 2.357897
H  6.725872 2.977911 0.913862
