program: Gaussian 09
title: 000149571
version: EM64L-G09RevD.01
frameworkgroup: C1[X(C23H22N4O4S)]
method: RPBEPBE
basis: SDD
operation: Freq
keyword: #p
keyword: freq=noraman
keyword: PBEPBE/SDD
title: #p freq=noraman PBEPBE/SDD
converged: YES YES NO NO
title: Mulliken charges:
elementType: S O O O O N N N N C C C C C C C C C C C C C C C C C C C C C C C H H H H H H H H H H H H H H H H H H H H H H
charge: 0.981971 -0.313600 -0.311110 -0.544794 -0.526020 -0.486058 -0.167087 -0.493877 -0.387130 0.219446 0.260891 0.217424 -0.096469 -0.028415 0.179539 0.268026 -0.350926 -0.374459 -0.330165 -0.379434 0.175265 -0.259448 -0.285823 0.313147 -0.262661 -0.491049 -0.224415 -0.358954 0.145653 -0.761019 -0.525603 -0.631637 0.347036 0.268136 0.231194 0.257565 0.292052 0.236262 0.277243 0.233367 0.245807 0.236719 0.293195 0.272054 0.380290 0.259582 0.297439 0.277455 0.226635 0.231216 0.250216 0.220753 0.222612 0.271964
chargesum: 0.00000
title: Mulliken charges with hydrogens summed into heavy atoms:
elementType: S O O O O N N N N C C C C C C C C C C C C C C C C C C C C C C C
charge: 0.981971 -0.313600 -0.311110 -0.544794 -0.526020 -0.139023 -0.167087 -0.221823 -0.006840 0.219446 0.260891 0.217424 -0.096469 -0.028415 0.179539 0.268026 -0.082790 -0.143264 -0.072600 -0.087382 0.175265 -0.023186 -0.008580 0.313147 -0.029294 -0.245242 0.012305 -0.065759 0.145653 0.073457 0.182464 0.083692
polarizability: 6.51255130e+02 6.45957422e+01 4.29585643e+02 -2.59050983e+01 -2.16580639e+01 1.99253157e+02
1716.lowfreq: -6.4071 -2.9182 -0.0011 -0.0006 0.0015 1.7283 9.2356 16.0465 18.5436
frequency: 7.7211 15.7891 18.5248 24.1424 34.8841 46.7516 58.6385 68.8112 77.3456 92.1868 104.9361 106.1890 122.2294 123.8693 130.9513 135.6105 146.5425 153.7403 170.5300 186.1162 216.0629 217.0504 233.7972 246.7153 258.7878 267.5083 276.6786 279.4606 318.3811 324.1202 334.4134 346.9299 357.7969 366.9145 385.9577 401.4372 414.9410 435.7697 451.9709 464.1279 494.5507 504.9505 516.9515 529.2040 539.1322 546.6486 561.2355 580.4570 596.7936 609.7057 625.4708 647.4455 663.4287 672.4352 712.3493 715.9605 720.7274 732.8495 759.9817 768.3830 782.3310 795.9007 808.8177 813.1703 823.2266 833.9688 837.6665 847.1564 862.1336 874.7611 891.7028 899.5205 920.2821 928.3011 946.4566 948.0567 958.4820 963.6513 964.0950 994.4078 1002.2442 1005.4683 1005.9181 1021.6391 1027.8359 1074.8341 1095.1880 1117.1431 1117.1981 1123.2275 1140.9547 1154.2789 1163.1661 1169.7491 1173.7975 1184.8024 1198.1517 1204.6702 1225.0696 1247.9872 1263.8623 1278.5603 1278.6753 1284.5654 1297.8960 1312.7767 1341.3584 1368.4383 1387.2628 1403.6810 1407.4475 1411.1985 1415.6075 1420.2743 1430.2515 1432.9456 1448.0652 1452.6435 1465.6617 1466.8425 1468.8149 1473.4172 1481.5584 1487.3380 1511.4040 1528.7603 1550.5771 1558.3082 1566.8727 1578.1965 1588.3406 1604.2370 1614.0495 1630.7638 2969.0686 2969.7810 3030.8195 3043.0891 3061.9492 3101.8016 3129.0245 3133.0294 3140.1330 3141.3684 3141.7906 3144.0334 3156.8428 3157.1031 3163.9839 3171.1431 3176.5156 3180.3482 3183.0550 3185.9687 3349.5159 3478.8913
redmass: 5.4066 6.0295 8.3404 4.6822 4.5111 5.6468 5.1235 3.2168 1.1973 4.7704 5.3448 4.2708 4.3744 6.3946 4.0685 4.1099 1.3576 2.9401 3.6020 3.5037 2.1274 2.9157 4.2272 3.9902 5.2037 3.9885 3.3090 4.9910 6.3220 6.2408 5.6530 5.5985 6.5831 7.5944 4.0003 4.5098 4.1407 5.6276 3.2207 4.8202 4.2377 6.8076 3.7441 7.1043 8.5223 5.1302 4.3079 3.2392 2.2683 6.1106 4.6972 2.2953 5.7627 5.8906 5.2250 6.0544 3.7797 4.2803 2.9500 1.5393 2.2319 4.1134 3.1786 2.2618 3.0097 2.9350 1.5612 1.4871 3.7208 2.1035 2.1300 6.0851 4.8104 1.0882 1.3530 4.4718 1.3990 1.3593 1.3443 1.3341 3.2192 1.9411 1.7576 3.1654 2.6236 2.1051 3.2293 1.3067 1.2609 1.9597 1.9855 1.3535 1.4790 1.6676 1.9444 1.1765 1.2113 1.6327 1.9739 3.1789 1.7343 2.7140 1.1551 2.6198 4.0989 2.1617 2.3942 2.9819 3.5518 3.7566 1.0643 1.2513 1.0587 2.6925 3.6334 1.7129 2.6451 2.8654 1.4372 1.1420 1.1268 1.8432 1.6353 1.0460 3.7226 5.7207 5.3609 5.7949 1.9744 4.1656 4.4215 6.2446 6.0074 5.8923 1.0353 1.0325 1.0238 1.1013 1.1046 1.0987 1.0861 1.1001 1.0867 1.0883 1.0872 1.0909 1.0922 1.0946 1.0890 1.1006 1.0970 1.1072 1.0971 1.1079 1.0753 1.0742
irintensity: 5.9793 2.1666 0.5014 0.4074 7.6251 0.4303 3.2218 0.4429 0.3232 5.6770 48.7100 7.5470 10.5189 16.1531 8.7549 4.2770 2.1476 0.4469 6.1325 6.2295 3.5036 6.3396 3.2877 2.5926 3.3732 5.4293 9.2701 1.7110 7.5843 21.3326 12.6115 4.8530 38.9899 34.0811 3.9287 72.7924 0.6996 14.0350 14.1701 4.9514 1.7501 1.9442 1.0364 10.2088 49.7358 9.6947 7.6097 9.7423 149.0835 6.2390 10.6128 57.9014 13.3375 44.8927 2.7912 2.5193 9.8799 16.0838 39.3045 45.7975 19.3529 1.6960 45.7158 112.8193 2.7988 17.2519 73.7335 68.0922 3.3091 1.1208 13.2342 7.7302 2.8149 95.0770 157.1760 3.7019 3.1346 2.2676 1.5991 0.7410 6.2950 54.4252 35.5331 12.9760 18.5190 9.6359 16.0038 0.3288 0.3126 92.8936 13.1891 0.5364 9.3097 22.1298 61.6402 10.1817 6.8667 7.3931 17.9824 6.0989 4.4161 79.1693 12.1358 51.6974 29.9820 60.7013 17.1814 65.1547 74.3098 154.5905 6.7942 9.5054 12.6870 19.9207 174.3433 16.1149 5.5708 12.8284 131.7469 45.0931 30.5402 64.3068 142.3275 14.8220 568.9913 122.8531 13.8647 232.6239 182.7139 35.3024 59.2633 229.1092 129.8848 55.3462 130.3776 48.5866 0.9449 39.9098 33.2547 31.0317 3.3760 15.6818 483.2140 160.5161 78.1417 2.7673 5.1610 3.1564 8.0021 35.8946 10.4516 0.3336 0.9273 1.3147 10.4466 72.8801
temp: 298.150 k
press: 1.00000 atm
elementType: 16 8 8 8 8 7 7 7 7 6 6 6 6 6 6 6 6 6 6 6 6 6 6 6 6 6 6 6 6 6 6 6 1 1 1 1 1 1 1 1 1 1 1 1 1 1 1 1 1 1 1 1 1 1
symmnumber: 1
zpe: 1073590.5 jmol-1
zpe.correction: 0.408909 hartree
zpe.thermalcorrener: 0.439656 hartree
zpe.thermalcorrenthalpy: 0.440600 hartree
zpe.thermalcorrgfe: 0.342898 hartree
zpe.sumelectzpe: -1805.189424 hartree
zpe.sumelectthermal: -1805.158677 hartree
zpe.sumelectthermalent: -1805.157732 hartree
zpe.sumelectthermalfe: -1805.255434 hartree
dipole: -0.0276 11.1693 5.0397
dipole: 12.2537
quadrupole: -223.5647 -194.1964 -196.7551
quadrupole: -3.2170 -41.0186 -4.6136
quadrupole: -18.7260 10.6423 8.0836 -3.2170 -41.0186 -4.6136
hfenergy: -1805.5983325 hartree
pointgroup: C01 [X(C23H22N4O4S1)]
dipole: -0.3347448 -3.4080034 -3.3934034 debye
polarizability: 635.8901637|-90.7233962|431.0016688|7.6583016|58.5310144|213.2020967 unknown
InChI: InChI=1S/C23H22N4O4S/c1-24-23(28)17-9-6-8-16-21(15-7-4-5-10-18(15)25-22(16)17)26-19-12-11-14(13-20(19)31-2)27-32(3,29)30/h4-13,24,26-27H,1-3H3
charge 0 multiplicity 1
54 atoms
S  -6.029862 2.273365 1.052278
O  -2.561404 -1.731061 -2.395783
O  4.920809 3.771671 1.006193
O  -7.655791 2.292268 1.146384
O  -5.098338 3.03321 2.143395
N  -0.417289 -0.962181 -1.104423
N  3.626827 -0.21242 0.07679
N  -5.487548 0.302495 1.093081
N  5.507378 1.510847 0.905351
C  0.901126 -0.67859 -0.684858
C  1.365944 0.657669 -0.448815
C  1.817939 -1.775602 -0.573195
C  2.755567 0.84351 -0.025195
C  3.194179 -1.478722 -0.209724
C  3.23229 2.19016 0.256636
C  -1.639939 -0.56869 -0.537448
C  0.546194 1.813759 -0.681204
C  1.438815 -3.148442 -0.77335
C  4.141594 -2.556557 -0.1229
C  2.368544 3.270013 0.055975
C  -2.8267 -0.988233 -1.229438
C  1.039512 3.090956 -0.434291
C  -1.78591 0.129908 0.690374
C  -4.234537 0.021059 0.505215
C  2.380976 -4.170706 -0.676372
C  -4.101935 -0.670681 -0.741377
C  3.748693 -3.87052 -0.360846
C  -3.059787 0.414343 1.209316
C  4.626447 2.553767 0.755164
C  -5.52133 2.993944 -0.670281
C  -3.701777 -2.249075 -3.156267
C  6.876199 1.71559 1.377721
H  -0.525469 -1.664063 -1.844451
H  -0.468024 1.685001 -1.06685
H  0.391987 -3.401593 -0.973978
H  5.173618 -2.303898 0.139439
H  2.765486 4.266764 0.277027
H  0.409865 3.967434 -0.618715
H  -0.895773 0.424553 1.252298
H  2.076848 -5.212222 -0.824928
H  -5.001845 -0.972484 -1.288564
H  4.478488 -4.684283 -0.291463
H  -3.173301 0.925083 2.169618
H  -6.294159 -0.124911 0.595078
H  5.126613 0.572058 0.652934
H  -6.156444 2.503146 -1.420068
H  -5.723431 4.071173 -0.59033
H  -4.45211 2.778505 -0.798691
H  -4.324897 -1.421497 -3.545069
H  -4.318561 -2.925589 -2.534603
H  -3.262896 -2.807724 -3.995278
H  7.612706 1.369565 0.627678
H  7.057986 1.171132 2.324071
H  7.024228 2.793496 1.553038
