program: Gaussian 09
title: 000149575
version: EM64L-G09RevD.01
frameworkgroup: C1[X(C25H24N4O4S)]
method: RPBEPBE
basis: SDD
operation: Freq
keyword: #p
keyword: freq=noraman
keyword: PBEPBE/SDD
title: #p freq=noraman PBEPBE/SDD
converged: YES YES NO NO
title: Mulliken charges:
elementType: S O O O O N N N N C C C C C C C C C C C C C C C C C C C C C C C C C H H H H H H H H H H H H H H H H H H H H H H H H
charge: 0.970728 -0.320020 -0.214009 -0.542804 -0.550850 -0.482251 -0.035157 -0.478236 0.002309 0.248776 0.200836 -0.270359 0.477513 0.235276 -0.533650 -0.074989 -0.372464 -0.467683 0.271377 -0.258933 -0.521369 -0.381087 -0.330812 0.162977 -0.260048 -0.276692 -0.231584 0.273351 -0.407769 -0.393448 0.122205 -0.766988 -0.530255 -0.424773 0.243706 0.236854 0.270129 0.348167 0.249636 0.229935 0.257908 0.280493 0.235730 0.263603 0.232184 0.272929 0.234976 0.301768 0.231483 0.265405 0.272436 0.295935 0.263244 0.232685 0.249609 0.242670 0.222610 0.226792
chargesum: 0.00000
title: Mulliken charges with hydrogens summed into heavy atoms:
elementType: S O O O O N N N N C C C C C C C C C C C C C C C C C C C C C C C C C
charge: 0.970728 -0.320020 -0.214009 -0.542804 -0.550850 -0.134084 -0.035157 -0.212831 0.002309 0.248776 0.200836 -0.270359 0.477513 0.235276 -0.053091 -0.074989 -0.102335 -0.218047 0.271377 -0.028998 0.017031 -0.145357 -0.067210 0.162977 -0.027864 -0.003763 0.003392 0.273351 -0.106001 -0.161965 0.122205 0.064626 0.194709 0.024629
polarizability: 6.77197093e+02 1.01639410e+02 4.36817427e+02 1.73519294e+00 3.56755562e+01 2.44794046e+02
1716.lowfreq: -4.1220 -3.3817 -0.0011 -0.0010 0.0012 3.2508 11.7140 13.6541 18.7358
frequency: 11.6018 13.5575 18.6551 20.5179 26.5296 27.5438 40.8238 45.5809 56.7354 72.4387 83.4237 93.8384 96.1867 110.4047 114.6841 116.4917 131.6047 148.5162 157.3778 169.5260 173.5044 176.2933 203.3748 212.3264 221.4796 230.0768 241.4374 261.0248 266.7984 282.8424 296.5262 312.7774 323.9763 338.4057 366.0171 377.4167 387.4294 400.1720 412.7204 432.2633 451.1962 454.0045 464.0540 491.2909 505.3276 526.5939 535.7115 540.3575 543.1588 561.9041 573.1334 580.1025 585.8164 605.1879 619.1973 624.5453 646.3407 658.5027 698.2618 707.3653 720.7981 734.1559 762.3079 770.4117 775.8175 780.5878 793.7886 800.9074 803.5670 820.7973 831.1998 842.9303 859.8678 862.5800 865.7452 878.3090 887.4400 907.2302 918.6419 927.9929 931.8722 944.5707 966.8723 978.3905 983.5199 996.1031 997.1050 1003.0243 1008.1781 1021.7356 1037.3366 1065.5784 1076.2826 1093.6987 1109.9403 1118.2509 1121.9042 1152.4997 1155.1603 1161.1224 1171.1641 1175.4712 1178.9117 1182.0350 1184.7743 1224.3177 1232.9587 1249.0299 1255.8789 1278.7666 1279.2266 1282.2296 1285.3908 1294.1083 1317.8165 1341.5651 1349.6729 1367.8487 1385.8668 1400.2140 1409.8474 1416.2970 1427.9550 1429.6128 1435.4750 1436.9732 1453.7771 1455.9556 1459.4421 1466.6958 1467.0358 1474.4255 1482.2501 1491.0754 1513.7428 1529.0597 1549.1468 1560.3361 1573.8711 1591.0183 1605.1076 1610.1504 1626.6186 1673.7518 2978.3513 2988.7898 2994.2556 3018.0160 3028.3301 3042.6979 3074.0847 3082.5396 3123.9868 3127.0453 3128.4232 3128.6181 3136.0780 3139.8809 3146.4612 3156.7290 3170.5810 3170.8000 3172.6199 3178.4395 3182.8802 3190.9474 3336.2902 3478.4388
redmass: 6.1322 5.9312 7.7227 5.7656 5.3603 5.9704 4.4111 5.7846 5.2525 3.2785 4.3284 3.5792 3.3501 4.4896 4.0235 6.7878 5.0668 3.6095 1.4953 4.8266 4.9304 2.7522 3.0999 1.7684 3.7508 3.8696 3.6773 2.7225 5.2733 3.8789 4.4099 6.9051 5.1479 4.2460 7.1810 3.1647 4.8982 4.1609 5.0495 3.6881 3.8941 3.5399 4.2086 3.8481 3.4586 7.3443 7.5791 4.3576 5.0861 4.0811 2.9468 3.3987 2.7089 2.8303 4.7307 5.0123 2.2865 5.9519 4.2855 6.0687 3.8415 2.0927 2.5311 1.5772 1.5025 1.8149 3.9013 1.6719 5.4170 3.7261 3.9563 1.5032 2.6880 2.1948 3.8113 1.9902 2.2546 3.7054 1.6198 2.3638 1.8180 1.3213 1.3585 2.8361 1.4403 1.3322 2.7230 2.8678 2.9790 2.1351 3.9152 1.3590 2.0420 3.0312 2.6085 1.3524 1.7284 1.2723 1.3726 1.2375 1.4075 1.4547 1.5340 1.5193 1.2424 2.0471 1.8558 2.9359 1.3731 1.6319 1.2400 1.9007 1.4351 3.1934 2.6178 2.2322 1.7071 2.7244 3.3625 2.8379 1.0582 1.0579 4.2984 3.5471 1.5342 1.1190 2.4796 1.5933 1.6880 1.0757 1.8277 1.8320 1.5185 1.1652 4.0543 6.9590 6.3856 7.5948 3.7863 7.2179 6.5996 5.7687 6.3386 7.5079 1.0318 1.0607 1.0624 1.0592 1.0238 1.0976 1.1049 1.1030 1.1101 1.0878 1.0856 1.0897 1.1017 1.0891 1.0916 1.0950 1.0989 1.0976 1.0949 1.1071 1.1080 1.0921 1.0752 1.0744
irintensity: 0.8896 2.6358 4.4752 0.3389 1.1012 2.6732 4.0893 1.4931 1.4662 2.1779 2.7653 30.2377 14.5523 24.1171 11.3186 33.1475 5.9729 10.5787 10.4033 8.9906 9.3270 9.0164 5.8789 7.7938 15.8792 14.1876 3.7108 2.7900 8.7921 0.0696 3.2976 13.5630 1.8970 12.6967 45.8264 6.5449 48.1646 19.1241 27.8460 16.9266 1.5936 6.2008 1.2326 15.5017 1.3367 2.8089 46.2207 27.4433 5.4838 10.6461 7.3416 4.3636 41.2143 111.3972 8.8167 4.0210 54.5217 1.9286 11.3972 8.6180 11.3744 2.8219 55.5179 53.1505 7.6394 29.2805 2.5379 78.7102 76.8648 12.7941 7.8168 116.7471 12.4141 11.0279 2.5689 0.7555 18.5303 3.3265 1.6269 1.2382 7.3738 141.2553 1.1316 1.2895 1.8155 0.4621 39.5190 53.0031 37.3012 11.8643 38.1793 42.1672 15.7983 14.5006 97.6009 16.5460 71.1800 15.1644 2.7836 3.6667 8.1637 40.2166 36.3617 15.4876 4.5267 32.1998 1.4586 23.6797 11.2693 53.0073 50.1034 18.5340 11.1403 19.9436 96.0183 90.1411 18.6347 97.1207 91.2962 50.7782 5.3048 11.5421 113.6824 100.6657 2.3135 17.8798 4.2656 56.7406 10.4014 19.7583 75.5738 86.9400 136.2000 20.5747 534.2164 82.4444 2.5886 26.9876 50.8351 174.8230 354.8836 57.0640 15.0602 79.8295 48.4914 24.0982 44.5561 15.5653 0.8386 4.1407 25.3428 9.5099 29.4304 14.4556 0.6058 7.5988 16.3399 10.6001 13.8727 20.0609 51.1538 2.6972 4.2524 0.1530 1.4422 1.3237 12.5227 70.6733
temp: 298.150 k
press: 1.00000 atm
elementType: 16 8 8 8 8 7 7 7 7 6 6 6 6 6 6 6 6 6 6 6 6 6 6 6 6 6 6 6 6 6 6 6 6 6 1 1 1 1 1 1 1 1 1 1 1 1 1 1 1 1 1 1 1 1 1 1 1 1
symmnumber: 1
zpe: 1154787.1 jmol-1
zpe.correction: 0.439835 hartree
zpe.thermalcorrener: 0.473144 hartree
zpe.thermalcorrenthalpy: 0.474088 hartree
zpe.thermalcorrgfe: 0.369397 hartree
zpe.sumelectzpe: -1882.413592 hartree
zpe.sumelectthermal: -1882.380284 hartree
zpe.sumelectthermalent: -1882.379339 hartree
zpe.sumelectthermalfe: -1882.484031 hartree
dipole: 3.1631 3.2553 0.4906
dipole: 4.5654
quadrupole: -282.8265 -181.3444 -205.6593
quadrupole: 13.4671 34.4847 2.6285
quadrupole: -59.5498 41.9324 17.6174 13.4671 34.4847 2.6285
hfenergy: -1882.8534273 hartree
pointgroup: C01 [X(C25H24N4O4S1)]
dipole: 1.120682 1.3976628 0.1295617 debye
polarizability: 657.3846095|120.0722268|461.0957144|5.9248952|23.6200013|240.328242 unknown
InChI: InChI=1S/C24H21N4O2.CH3O2S/c1-26-22(29)13-10-15-6-5-8-18-23(15)27-19-9-4-3-7-17(19)24(18)28-20-12-11-16(25)14-21(20)30-2;1-4(2)3/h3-9,11-12,14,25,28H,1,10,13H2,2H3;1H3
charge 0 multiplicity 1
58 atoms
S  -6.643024 -2.464957 0.36137
O  -3.495083 1.993518 -1.249423
O  7.314611 -2.23905 -0.038571
O  -7.77497 -3.263394 1.21786
O  -7.053341 -1.399555 -0.804476
N  -1.057046 1.22227 -0.674569
N  3.210415 0.805345 -0.379585
N  -5.476257 -1.374804 1.718275
N  6.928978 -1.725859 2.213306
C  0.986412 -0.193075 -0.887245
C  0.344364 1.045822 -0.564744
C  2.439541 -0.269047 -0.740554
C  3.126088 -1.518664 -1.02754
C  1.142257 2.173796 -0.186634
C  4.627338 -1.616984 -0.836542
C  2.588774 2.001837 -0.136771
C  0.280666 -1.331806 -1.408733
C  2.3810 -2.601129 -1.496713
C  -2.083226 0.483615 -0.073193
C  0.965109 -2.505219 -1.706317
C  5.023126 -1.622043 0.659031
C  0.586172 3.452219 0.168539
C  3.411892 3.131116 0.204785
C  -3.428858 0.904725 -0.363585
C  1.414546 4.521964 0.501694
C  -1.893438 -0.59239 0.834318
C  2.842098 4.364354 0.507031
C  -4.329013 -0.815096 1.124908
C  -4.529986 0.283923 0.230428
C  -2.998065 -1.256325 1.394878
C  6.518469 -1.851306 0.861202
C  -5.537045 -3.792163 -0.517478
C  -4.829573 2.491256 -1.612522
C  7.713368 -0.830699 2.714717
H  5.12164 -0.755393 -1.31909
H  5.013652 -2.533098 -1.31591
H  -0.795607 -1.26277 -1.586916
H  -1.389392 2.07842 -1.131603
H  2.894727 -3.540545 -1.731915
H  0.424044 -3.364321 -2.117573
H  4.482923 -2.418288 1.208905
H  4.728976 -0.664247 1.127995
H  -0.501171 3.581207 0.204413
H  4.494768 2.973688 0.215736
H  0.977088 5.48836 0.774607
H  -0.879006 -0.908132 1.090857
H  3.47836 5.21797 0.764714
H  -5.555912 0.60517 0.038048
H  -2.833319 -2.098386 2.078159
H  -5.255495 -2.106599 2.425376
H  -4.655048 -3.262347 -0.902942
H  -6.166688 -4.194333 -1.323379
H  -5.291265 -4.549376 0.239513
H  -5.355031 2.889659 -0.724619
H  -5.432827 1.688533 -2.074635
H  -4.650186 3.297164 -2.338453
H  8.124796 0.016385 2.133708
H  8.002172 -0.903216 3.773156
