program: Gaussian 09
title: 000149512
version: EM64L-G09RevD.01
frameworkgroup: C1[X(C15H11FO2)]
method: RPBEPBE
basis: SDD
operation: Freq
keyword: #p
keyword: freq=noraman
keyword: PBEPBE/SDD
title: #p freq=noraman PBEPBE/SDD
converged: YES YES NO NO
title: Mulliken charges:
elementType: F O O C C C C C C C C C C C C C C C H H H H H H H H H H H
charge: -0.192094 -0.268916 -0.211428 -0.264080 -0.240805 0.461952 0.160809 0.311933 -0.370433 -0.406598 -0.231047 -0.226499 -0.300822 -0.314194 -0.236253 -0.383551 -0.369803 0.335040 0.273286 0.233031 0.261606 0.238328 0.228916 0.229739 0.237132 0.284989 0.231612 0.263237 0.264913
chargesum: 0.00000
title: Mulliken charges with hydrogens summed into heavy atoms:
elementType: F O O C C C C C C C C C C C C C C C
charge: -0.192094 -0.268916 -0.211428 0.009206 -0.007774 0.461952 0.160809 0.311933 -0.108827 -0.168269 -0.002131 0.003240 -0.063690 -0.029205 -0.004641 -0.120313 -0.104890 0.335040
polarizability: 2.52125232e+02 -3.96319319e+00 1.55234494e+02 -4.08938963e+00 -2.01680615e+01 1.05581919e+02
1716.lowfreq: -5.2133 -0.0008 -0.0007 -0.0003 3.3758 8.3297 10.4922 27.5797 37.9786
frequency: 7.8416 27.5346 37.4150 69.0622 96.9814 103.7161 153.1902 194.5847 250.8995 263.7074 296.4713 344.2776 375.4965 389.4333 402.5082 409.7946 453.2796 495.4372 530.6056 573.8871 596.2462 614.9249 624.1846 668.6109 702.4670 726.1763 750.4482 755.7888 786.1631 799.6267 817.6650 821.8475 850.8863 855.1798 858.8214 925.4433 951.8081 978.4412 986.3407 988.5329 992.0505 998.0590 1006.1038 1026.6628 1057.4754 1083.6083 1094.8390 1110.5620 1158.5504 1173.1947 1176.6022 1185.2716 1208.2834 1233.5985 1236.3599 1294.0859 1307.2070 1330.9550 1374.4308 1384.1748 1391.7989 1414.5245 1443.4163 1487.2975 1492.8872 1558.8547 1592.7315 1596.7839 1610.3714 1616.2685 3103.7665 3121.4004 3122.2504 3129.4409 3140.8678 3151.7066 3159.5972 3159.9670 3166.5503 3179.9791 3183.2796
redmass: 5.0254 4.5638 4.7863 5.4484 6.5721 10.2452 5.3866 6.3410 6.7779 7.6707 6.7926 6.3157 6.5634 7.0239 2.8432 2.9265 5.5429 3.0792 3.2874 6.8898 6.2314 6.4707 7.1736 5.1741 1.9263 4.6284 3.9345 2.5329 3.9599 3.6356 5.7837 1.3781 3.8782 1.2638 1.8874 1.4640 1.3913 1.4022 1.4589 5.3389 3.5016 1.3767 2.3852 2.1401 1.3776 1.5327 1.2335 1.3015 1.4242 1.1535 2.3318 1.1641 2.3003 2.2019 1.5252 1.3729 1.6532 1.3922 4.1162 5.2846 3.7621 3.9611 2.2223 2.4712 2.6013 9.6190 6.2124 7.4575 6.6924 6.0807 1.0898 1.0890 1.0868 1.0868 1.0915 1.0963 1.0885 1.0890 1.1016 1.0966 1.0975
irintensity: 0.3150 0.0570 0.4629 0.9973 1.6395 4.4174 0.2386 2.6126 3.5448 9.1042 1.7892 1.6872 2.9222 2.2372 0.1404 0.2483 0.4981 14.9697 10.2289 58.1508 6.3583 0.0518 1.0764 19.4355 43.6442 4.2493 51.2549 36.3402 17.7881 4.8200 28.7949 1.7841 2.7053 0.1801 70.6494 0.8148 0.5026 0.4813 2.4060 5.3592 36.2123 2.4486 1.5335 11.5813 9.1043 11.0531 4.7887 13.9379 101.6856 0.1573 0.7727 3.8074 25.5150 174.4738 59.0542 19.4567 10.6900 52.2101 22.6137 59.4107 63.7787 39.9721 13.8128 5.8194 21.7661 121.8671 3.0371 54.8731 111.4039 1.2845 1.2501 9.3924 7.9744 0.2865 12.0576 29.2824 6.4174 1.3543 25.4421 3.5211 3.8152
temp: 298.150 k
press: 1.00000 atm
elementType: 9 8 8 6 6 6 6 6 6 6 6 6 6 6 6 6 6 6 1 1 1 1 1 1 1 1 1 1 1
symmnumber: 1
zpe: 566979.3 jmol-1
zpe.correction: 0.215951 hartree
zpe.thermalcorrener: 0.230959 hartree
zpe.thermalcorrenthalpy: 0.231903 hartree
zpe.thermalcorrgfe: 0.170053 hartree
zpe.sumelectzpe: -827.186098 hartree
zpe.sumelectthermal: -827.171090 hartree
zpe.sumelectthermalent: -827.170145 hartree
zpe.sumelectthermalfe: -827.231996 hartree
dipole: 0.7865 -2.6345 -1.9398
dipole: 3.3648
quadrupole: -98.1155 -102.5407 -106.3928
quadrupole: -6.7459 -5.2998 -9.0868
quadrupole: 4.2342 -0.1910 -4.0432 -6.7459 -5.2998 -9.0868
hfenergy: -827.4020487 hartree
pointgroup: C01 [X(C15H11F1O2)]
dipole: -0.3113147 1.239122 0.346645 debye
polarizability: 250.2653619|-12.6855425|104.3524903|11.0505976|16.3720727|158.3237926 unknown
InChI: InChI=1S/C15H11FO2/c16-12-8-6-10(7-9-12)13(17)15-14(18-15)11-4-2-1-3-5-11/h1-9,14-15H
charge 0 multiplicity 1
29 atoms
F  5.834075 1.071961 1.572082
O  -1.225542 -1.846382 0.279549
O  0.988163 -1.512726 -1.736357
C  -1.647508 -0.844803 -0.763691
C  -0.377481 -0.615957 0.029444
C  -2.885512 -0.050827 -0.502835
C  0.954296 -0.866612 -0.645595
C  2.206343 -0.331561 -0.024086
C  -3.427072 0.0586 0.803516
C  -3.527517 0.61036 -1.580699
C  -4.586709 0.830227 1.028715
C  -4.684857 1.387093 -1.352469
C  2.252508 0.211601 1.290337
C  3.407081 -0.400652 -0.786822
C  -5.216227 1.501308 -0.046875
C  3.465913 0.680014 1.833677
C  4.624927 0.06787 -0.264599
C  4.62316 0.601166 1.039132
H  -1.485455 -1.212237 -1.786141
H  -0.427702 0.114434 0.844881
H  -2.952467 -0.492916 1.623124
H  -3.121367 0.517314 -2.595393
H  -5.005697 0.903097 2.038524
H  -5.174087 1.895811 -2.190463
H  1.353009 0.253654 1.911194
H  3.355468 -0.832805 -1.791084
H  -6.117529 2.098834 0.129208
H  3.523752 1.093391 2.844275
H  5.555131 0.026144 -0.837949
