program: Gaussian 09
title: 000102880
version: EM64L-G09RevD.01
frameworkgroup: C1[X(C16H20N2O4)]
method: RPBEPBE
basis: SDD
operation: Freq
keyword: #p
keyword: freq=noraman
keyword: PBEPBE/SDD
title: #p freq=noraman PBEPBE/SDD
converged: YES YES NO NO
title: Mulliken charges:
elementType: O O O O N N C C C C C C C C C C C C C C C C H H H H H H H H H H H H H H H H H H H H
charge: -0.271044 -0.240496 -0.208684 -0.211123 -0.075129 0.026196 -0.202874 -0.114103 -0.477163 -0.480088 -0.028294 -0.436599 -0.480381 -0.650267 0.291480 -0.670417 0.469085 -0.326458 -0.395672 -0.352170 -0.349897 0.370595 0.278286 0.231907 0.226279 0.232384 0.233370 0.213620 0.272715 0.201924 0.222948 0.225542 0.219819 0.196504 0.235825 0.229977 0.249927 0.246828 0.277500 0.245412 0.286555 0.286181
chargesum: 0.00000
title: Mulliken charges with hydrogens summed into heavy atoms:
elementType: O O O O N N C C C C C C C C C C C C C C C C
charge: -0.271044 -0.240496 -0.208684 -0.211123 -0.075129 0.026196 0.075412 0.117804 -0.018500 -0.033097 0.244421 -0.011727 -0.035020 0.012038 0.291480 -0.173662 0.469085 -0.048958 -0.150261 -0.065615 -0.063716 0.370595
polarizability: 2.72653060e+02 1.07201188e+01 1.81129424e+02 -2.16017657e+01 1.53958241e+01 1.51716559e+02
1716.lowfreq: -9.0430 -5.7207 -0.0006 -0.0003 0.0006 5.7917 8.2262 18.9481 25.3665
frequency: -2.3055 17.0917 25.0171 55.6456 65.9719 67.7508 84.3214 118.2464 159.0330 173.2920 197.4979 206.6348 226.6969 243.1410 265.4582 275.0868 310.5920 324.9693 350.5952 363.8014 380.2039 409.7794 423.1334 457.2498 481.6118 506.5661 532.9626 549.5025 575.2507 624.7441 642.0740 666.2068 682.3280 703.6457 736.3735 745.5880 754.8751 778.6271 797.5594 817.9687 823.3902 838.5829 852.9722 859.0134 875.4049 885.2087 925.7646 943.5011 948.6627 953.5380 971.9199 986.6074 987.8897 997.4226 1006.3346 1007.6369 1054.0886 1079.3718 1092.6365 1097.7192 1104.3744 1118.3845 1120.9979 1125.4451 1145.7113 1165.7809 1183.4604 1197.5829 1205.9057 1215.0808 1215.8562 1219.9689 1226.7854 1229.0620 1253.1774 1280.9092 1281.8757 1292.2163 1294.2278 1308.5067 1313.0623 1331.1929 1339.2983 1341.4787 1360.8537 1366.8419 1402.6718 1422.1417 1430.7093 1453.3603 1455.8665 1465.4123 1467.5648 1472.8894 1482.2735 1482.5423 1492.1975 1597.1362 1606.3250 1629.3804 2888.9379 2993.8580 3003.6770 3003.9334 3009.6365 3017.4565 3029.0170 3042.5947 3047.2670 3054.6514 3056.5575 3065.3313 3072.0350 3082.3117 3083.9570 3100.6980 3143.4708 3156.0142 3182.6040 3185.3701
redmass: 5.9154 4.6112 5.8548 5.0918 8.5888 6.6757 4.2054 7.3093 2.8045 2.8316 3.6120 1.1736 3.5412 5.1165 2.2301 3.2054 5.5661 3.2421 2.3129 7.0620 2.9066 2.8946 3.8397 3.3313 3.6883 7.2329 3.6788 3.3840 3.1808 6.6241 5.5313 5.1575 3.5907 4.9787 5.4116 4.2830 1.7523 6.5612 2.6175 2.5819 3.4735 2.7806 1.3096 2.0376 2.4665 2.4920 3.1265 2.2268 2.6885 2.3728 2.1716 1.3755 2.4089 1.3719 1.9986 3.0926 1.6526 1.7350 2.8625 1.9000 1.6888 1.4932 1.4867 1.8046 1.3031 1.4604 1.3517 2.0614 2.7729 1.4969 1.4652 2.0772 2.0236 1.5922 1.3879 1.3206 1.3755 1.4007 1.4080 1.4738 1.4929 1.4341 1.5516 1.4883 1.5843 6.5575 8.0062 3.0514 1.1660 1.1257 1.0860 1.0691 1.0690 1.0834 2.3227 1.0565 1.0866 7.8179 6.3338 9.7811 1.0531 1.0600 1.0608 1.0610 1.0635 1.0627 1.0765 1.0888 1.0932 1.0989 1.0977 1.0930 1.0993 1.1034 1.1005 1.0980 1.0906 1.0906 1.0946 1.0959
irintensity: 0.3294 0.0992 0.1736 0.4498 2.3619 0.8969 0.9319 0.5477 3.5034 4.4811 1.6094 0.1139 5.0961 5.6834 0.5246 0.5050 1.5795 1.7156 1.4782 8.2478 2.9942 0.0462 2.9758 3.4782 13.5611 0.8292 4.2546 4.7320 6.1266 1.1884 5.1412 18.0211 9.0889 19.6250 13.3585 0.8686 8.0604 12.1774 3.1979 12.9449 12.5881 7.3236 0.4105 9.9416 53.8311 23.9681 18.6552 2.9262 71.7398 54.8722 21.6634 9.3214 7.5432 1.4647 5.3033 7.9677 23.8275 12.4818 10.5291 231.6023 1.5596 124.9278 44.0405 44.2698 0.8430 2.7403 55.0527 14.8914 1.0652 128.9313 36.9067 282.4847 33.6542 19.5214 2.9992 5.6973 30.5435 32.7303 2.2544 3.7325 56.2545 2.7735 4.3657 1.1468 1.2679 106.9708 1.6277 43.2193 3.4936 17.8391 5.9266 12.2847 10.7132 10.1390 13.5100 2.3117 28.3257 5.5582 68.4108 143.6695 108.6660 28.7237 33.5159 16.9771 5.1862 39.7292 44.0279 52.9267 17.4058 8.4644 8.7145 5.9435 57.8963 46.0482 31.3221 5.9492 8.9016 0.3823 0.5476 2.8446
temp: 298.150 k
press: 1.00000 atm
elementType: 8 8 8 8 7 7 6 6 6 6 6 6 6 6 6 6 6 6 6 6 6 6 1 1 1 1 1 1 1 1 1 1 1 1 1 1 1 1 1 1 1 1
symmnumber: 1
zpe: 893028.1 jmol-1
zpe.correction: 0.340136 hartree
zpe.thermalcorrener: 0.359166 hartree
zpe.thermalcorrenthalpy: 0.360110 hartree
zpe.thermalcorrgfe: 0.290991 hartree
zpe.sumelectzpe: -1030.371155 hartree
zpe.sumelectthermal: -1030.352125 hartree
zpe.sumelectthermalent: -1030.351181 hartree
zpe.sumelectthermalfe: -1030.420300 hartree
dipole: -7.2380 0.8452 3.3895
dipole: 8.0369
quadrupole: -161.4727 -127.6912 -128.8305
quadrupole: -4.4898 10.9201 -1.3587
quadrupole: -22.1412 11.6403 10.5009 -4.4898 10.9201 -1.3587
hfenergy: -1030.7112912 hartree
pointgroup: C01 [X(C16H20N2O4)]
dipole: -2.8021076 -0.0024307 1.4649648 debye
polarizability: 264.5488811|22.5887895|188.4889944|-30.8841651|7.6112306|152.4611678 unknown
InChI: InChI=1S/C16H20N2O4/c1-17-12-6-8-14(17)15(9-7-12)22-16(19)10-11-2-4-13(5-3-11)18(20)21/h2-5,12,14-15H,6-10H2,1H3
charge 0 multiplicity 1
42 atoms
O  -1.202527 0.191224 0.627708
O  -0.109354 -1.792824 0.053162
O  6.458479 0.257606 -1.78922
O  6.310192 2.382057 -0.972371
N  -4.398523 -1.370209 -0.636293
N  5.867437 1.174453 -1.097401
C  -3.323925 -1.132435 0.377811
C  -5.207083 -0.110756 -0.522584
C  -4.041774 -0.507048 1.62287
C  -5.322044 0.16556 1.021074
C  -2.346763 -0.138916 -0.301433
C  -4.417638 0.998494 -1.259687
C  -3.018408 1.206661 -0.618008
C  -5.165813 -2.61774 -0.416026
C  -0.1566 -0.718441 0.696923
C  0.930165 -0.219508 1.652048
C  2.217452 0.145501 0.91814
C  2.902135 -0.822371 0.134586
C  2.749422 1.45677 1.018719
C  4.097456 -0.492606 -0.530449
C  3.945795 1.804901 0.361125
C  4.605156 0.819813 -0.404586
H  -2.791015 -2.071484 0.600658
H  -6.191287 -0.25444 -1.001989
H  -3.38746 0.213645 2.144359
H  -4.306546 -1.295179 2.349376
H  -6.239952 -0.293515 1.429464
H  -5.370266 1.247314 1.239414
H  -1.929691 -0.630382 -1.19764
H  -4.978556 1.952327 -1.238555
H  -4.310422 0.692969 -2.316703
H  -2.369528 1.808503 -1.279181
H  -3.120801 1.771594 0.327953
H  -5.675933 -2.681548 0.575066
H  -4.484047 -3.481519 -0.506459
H  -5.935108 -2.712048 -1.202727
H  1.134555 -1.042511 2.362982
H  0.546169 0.642589 2.218388
H  2.480951 -1.828365 0.038889
H  2.223797 2.210112 1.615608
H  4.63897 -1.222483 -1.137767
H  4.371934 2.809232 0.428157
