program: Gaussian 09
title: 000149527
version: EM64L-G09RevD.01
frameworkgroup: C1[X(C22H20O7)]
method: RPBEPBE
basis: SDD
operation: Freq
keyword: #pfreq=noraman
keyword: PBEPBE/SDD
title: #p freq=noraman PBEPBE/SDD
converged: YES YES NO NO
title: Mulliken charges:
elementType: O O O O O O O C C C C C C C C C C C C C C C C C C C C C C H H H H H H H H H H H H H H H H H H H H
charge: -0.386501 -0.271047 -0.346643 -0.230902 -0.329643 -0.295494 -0.390151 -0.047630 -0.357323 -0.496376 0.215000 -0.616869 0.219987 -0.415216 -0.139920 -0.095332 0.234112 0.115237 0.209954 -0.720898 -0.107883 -0.019311 -0.004652 0.380769 0.133880 -0.427186 -0.511162 -0.354207 -0.192710 0.213390 0.316717 0.248063 0.213194 0.229598 0.250382 0.198248 0.219299 0.202272 0.263240 0.216747 0.393068 0.375986 0.293934 0.251510 0.239389 0.233206 0.262823 0.240273 0.386778
chargesum: 0.00000
title: Mulliken charges with hydrogens summed into heavy atoms:
elementType: O O O O O O O C C C C C C C C C C C C C C C C C C C C C C
charge: 0.006567 -0.271047 0.029343 -0.230902 -0.329643 -0.295494 -0.003373 0.165760 -0.040606 -0.035118 0.215000 -0.136889 0.219987 0.002331 -0.139920 -0.095332 0.234112 0.115237 0.209954 -0.038640 -0.107883 -0.019311 -0.004652 0.380769 0.133880 -0.133252 0.212943 -0.091384 0.047563
polarizability: 4.74950245e+02 -2.35130565e+01 2.84777096e+02 9.94423182e+00 1.43080058e+01 1.54232836e+02
1716.lowfreq: -7.1732 -0.0007 -0.0005 0.0006 5.8181 7.7987 26.5889 31.1867 44.5112
frequency: 26.5668 30.8987 44.4614 53.5553 73.3266 92.1160 100.0681 111.8495 116.6918 129.1749 140.5584 157.5152 169.6857 177.2140 194.7968 203.4312 217.6588 245.3008 254.6099 261.4748 267.6511 276.9460 301.9957 316.4283 334.3141 346.9577 376.0366 392.2488 406.5003 419.6048 435.5189 440.9068 447.4679 450.6743 461.4145 470.8983 482.9956 512.1862 522.9899 540.2837 553.6045 573.1061 603.3398 629.4749 650.6572 677.0990 695.6095 717.5636 727.2474 734.0333 750.1694 776.2947 781.1874 794.1311 804.2297 839.4130 841.1039 850.4549 891.9010 917.8338 927.4355 939.7508 951.6083 977.6721 987.9972 992.4532 996.0793 1013.1116 1019.2283 1021.0900 1054.7770 1072.5593 1079.2433 1084.3804 1112.2890 1114.3458 1128.6917 1140.3924 1147.5022 1159.1431 1175.0581 1183.5719 1189.3645 1220.2625 1234.8604 1255.2860 1263.2491 1275.5319 1286.1372 1289.4703 1296.2072 1298.5299 1308.9338 1325.3689 1332.5326 1341.8931 1345.9012 1364.2809 1367.0703 1394.6129 1404.4636 1405.4810 1418.5454 1420.6608 1441.6629 1451.7671 1452.4136 1456.1727 1459.6996 1463.2367 1465.0879 1473.8169 1477.7571 1498.7935 1543.1663 1550.5958 1576.6227 1588.5962 1607.8506 1622.0290 1638.2973 2464.2155 2603.1120 2929.7095 2950.8234 2972.5827 2973.1864 2979.5164 3000.3250 3006.3267 3025.7978 3034.2443 3058.1830 3070.4797 3093.7937 3109.5606 3146.0640 3151.0623 3171.2557 3180.1678 3532.6040
redmass: 5.0773 5.9280 5.0825 5.7074 6.2706 3.5245 3.7443 1.3349 3.2830 3.9688 3.2469 6.9714 3.6073 7.9884 2.1394 2.9858 4.9827 4.6260 1.8631 3.2195 3.7802 3.4822 2.1979 5.6273 5.7667 6.5283 2.0116 4.9953 5.9079 4.7816 10.0985 4.3364 9.3947 4.2602 6.4697 3.0651 7.4786 5.6040 4.6937 5.7046 6.3401 5.2855 5.8104 5.9873 5.4737 5.6738 5.0886 4.1479 4.5923 4.5431 5.2018 2.8809 1.9495 3.9673 2.5198 3.9125 3.4811 2.2848 3.6568 3.7321 1.4386 2.7216 3.2413 3.6161 1.0627 2.6301 1.3580 3.3249 1.2229 2.0346 2.3239 2.2554 1.7823 3.3247 1.2707 2.4409 1.9405 2.5255 1.4885 2.8086 1.3348 1.6195 1.8751 2.1753 1.3475 1.3385 1.9507 1.9625 1.9085 2.5085 1.3346 1.8238 3.1525 2.9403 1.6756 1.4131 1.4997 3.5964 2.1129 1.2333 4.1779 4.5692 5.3604 1.1811 2.0423 2.6794 1.0560 1.7529 5.1326 1.0804 1.0749 1.0568 1.0716 1.0512 3.4564 5.5048 4.0374 3.5891 4.6423 5.6482 9.1162 1.0769 1.0720 1.0580 1.0830 1.0966 1.0616 1.0387 1.0620 1.0294 1.0993 1.0829 1.1033 1.0986 1.0994 1.1046 1.0879 1.1051 1.0922 1.0985 1.0647
irintensity: 0.2049 0.3890 1.3035 3.9447 0.1989 0.0810 0.7627 0.2394 0.1186 0.0726 0.4787 0.2884 0.1017 0.3593 1.1305 2.2261 0.0650 4.3309 1.0003 0.9748 2.6693 7.8809 26.2476 4.7016 9.0758 13.0270 68.4621 9.2198 4.2754 4.2949 24.1047 10.2842 2.8863 1.2499 27.0576 2.0671 1.4351 1.9498 0.0970 1.1898 2.3015 0.5275 8.9351 2.9076 1.8138 1.9333 4.9260 9.4026 7.0616 13.1657 13.8947 18.7432 12.2858 6.2337 34.0642 1.4548 23.5492 2.3096 21.9065 48.7283 0.0202 37.4531 20.4772 36.9553 115.7567 19.0573 0.8845 22.4301 84.2078 26.2047 5.5676 19.7031 49.8366 12.0607 0.0832 84.0801 23.6320 17.4017 24.4878 41.1587 54.6092 80.2855 56.1251 58.4883 14.6474 32.1893 60.2053 197.4411 110.8766 216.2525 21.7885 10.6198 49.9911 276.9988 125.2320 4.3431 69.6866 35.9180 27.4214 52.7889 262.0002 19.3760 25.1401 16.0988 12.8681 172.2395 13.7304 1.9115 371.3830 19.7315 4.5099 4.7396 16.8572 15.5404 6.7660 32.4836 71.7263 16.0654 16.8181 41.8626 243.5172 175.9767 236.7939 24.9185 16.8011 14.4599 32.7332 32.7345 55.9595 36.2703 22.3335 0.9132 34.8524 50.1584 34.1746 21.4347 13.3737 11.5060 0.8508 14.7997 77.9393
temp: 298.150 k
press: 1.00000 atm
elementType: 8 8 8 8 8 8 8 6 6 6 6 6 6 6 6 6 6 6 6 6 6 6 6 6 6 6 6 6 6 1 1 1 1 1 1 1 1 1 1 1 1 1 1 1 1 1 1 1 1
symmnumber: 1
zpe: 983037.4 jmol-1
zpe.correction: 0.374419 hartree
zpe.thermalcorrener: 0.399866 hartree
zpe.thermalcorrenthalpy: 0.400810 hartree
zpe.thermalcorrgfe: 0.319564 hartree
zpe.sumelectzpe: -1374.881745 hartree
zpe.sumelectthermal: -1374.856298 hartree
zpe.sumelectthermalent: -1374.855354 hartree
zpe.sumelectthermalfe: -1374.936601 hartree
dipole: -3.4556 2.0001 1.0486
dipole: 4.1281
quadrupole: -167.0203 -171.3784 -160.4791
quadrupole: -31.6024 -5.9220 -4.9865
quadrupole: -0.7277 -5.0858 5.8135 -31.6024 -5.9220 -4.9865
hfenergy: -1375.2561643 hartree
pointgroup: C01 [X(C22H20O7)]
dipole: -1.3793403 0.8037207 0.2986099 debye
polarizability: 475.5174618|-18.1422113|285.4538543|15.8520948|-2.1482926|152.988861 unknown
InChI: InChI=1S/C22H20O7/c1-3-9-7-8-11-15(13(9)22(28)29-2)21(27)17-16(19(11)25)20(26)14-10(18(17)24)5-4-6-12(14)23/h4-6,9,13,23,25,27H,3,7-8H2,1-2H3
charge 0 multiplicity 1
49 atoms
O  -0.970411 -2.177728 -0.312908
O  -3.071886 -0.508509 1.973294
O  0.356707 3.239755 -0.097549
O  -4.410313 -2.036899 0.845315
O  1.428053 -2.76782 -0.166547
O  2.916982 2.559695 0.040709
O  5.333733 1.925073 0.170159
C  -4.051549 0.732708 -0.944016
C  -3.08432 -0.399921 -0.460584
C  -3.841309 1.985551 -0.065445
C  -1.659963 0.112514 -0.304409
C  -2.413461 2.54958 -0.23436
C  -1.333752 1.474274 -0.224345
C  -5.540201 0.315025 -1.020801
C  -0.609644 -0.857078 -0.257542
C  0.046211 1.883628 -0.137395
C  -3.59544 -1.089732 0.814191
C  0.758552 -0.46052 -0.156604
C  1.104016 0.938404 -0.101845
C  -5.820439 -0.866874 -1.974498
C  1.777763 -1.510532 -0.116535
C  2.527064 1.319896 -0.008294
C  3.54561 0.25408 0.027653
C  3.197862 -1.131686 -0.021769
C  4.93555 0.61588 0.117493
C  4.194495 -2.129669 0.016294
C  -3.501462 -1.134883 3.249283
C  5.930529 -0.399987 0.153836
C  5.557749 -1.754771 0.10379
H  -3.724391 0.98045 -1.977976
H  -3.078166 -1.210513 -1.211506
H  -4.014702 1.725605 0.995497
H  -4.575541 2.766077 -0.338993
H  -2.231707 3.282602 0.581792
H  -2.35775 3.112949 -1.191514
H  -6.114063 1.202208 -1.358009
H  -5.916753 0.066259 -0.009161
H  -5.413647 -0.670789 -2.985305
H  -5.376383 -1.800874 -1.590284
H  -6.907759 -1.035207 -2.077225
H  -0.06963 -2.730005 -0.265046
H  -0.46889 3.789629 -0.109529
H  3.888572 -3.178499 -0.023977
H  -3.211325 -2.198417 3.26232
H  -4.595579 -1.056624 3.36518
H  -2.975199 -0.568768 4.030298
H  6.977967 -0.092371 0.221624
H  6.333523 -2.526997 0.132837
H  4.456098 2.496633 0.130709
