program: Gaussian 09
title: 000149507
version: EM64L-G09RevD.01
frameworkgroup: C1[X(C10H18N2O3)]
method: RPBEPBE
basis: SDD
operation: Freq
keyword: #p
keyword: freq=noraman
keyword: PBEPBE/SDD
title: #p freq=noraman PBEPBE/SDD
converged: YES YES NO NO
title: Mulliken charges:
elementType: O O O N N C C C C C C C C C C H H H H H H H H H H H H H H H H H H
charge: -0.317647 -0.330568 -0.379062 -0.364892 -0.307504 0.014916 -0.434273 -0.436736 -0.403482 -0.403111 -0.384983 -0.595066 0.282854 -0.472903 0.271163 0.242668 0.186198 0.196916 0.221476 0.178904 0.199133 0.198189 0.198149 0.202402 0.202781 0.187190 0.243149 0.208678 0.316824 0.264134 0.248361 0.392803 0.373340
chargesum: 0.00000
title: Mulliken charges with hydrogens summed into heavy atoms:
elementType: O O O N N C C C C C C C C C C
charge: -0.317647 -0.330568 -0.005723 -0.048068 0.085299 0.257584 -0.051159 -0.036357 -0.006160 -0.002560 0.004988 -0.143239 0.282854 0.039591 0.271163
polarizability: 1.51139797e+02 -4.00823789e+00 1.26506926e+02 1.14059865e+01 5.62834401e+00 1.11233050e+02
1716.lowfreq: -6.8964 -1.0693 -0.0008 -0.0004 0.0003 8.1109 18.1080 34.0273 52.0729
frequency: 17.2488 33.7147 51.9669 65.1723 105.2056 132.3691 153.8923 178.8315 220.6379 226.6384 251.6002 259.2640 305.7478 320.6346 350.4222 409.5935 419.6141 433.3756 444.9124 475.9646 520.2684 553.9428 586.1568 612.7375 685.6204 727.7844 758.3144 778.3210 787.3163 838.8960 840.6443 853.4997 894.2781 909.7321 918.9165 933.7480 960.4121 963.4426 1028.5827 1042.4962 1053.9767 1058.6143 1079.9573 1095.5988 1114.5488 1122.5296 1168.1254 1190.3884 1221.4760 1245.0794 1253.7755 1258.4125 1261.3312 1264.9358 1285.1593 1314.8398 1330.4435 1334.8895 1336.3745 1339.4730 1340.2598 1345.1535 1359.2783 1362.5098 1432.9019 1440.5904 1458.3515 1462.8796 1463.4133 1468.7852 1475.7526 1478.4934 1493.7721 1571.4345 1598.8044 2947.1092 2949.7932 2965.2457 2968.1819 2968.5049 2971.1616 2982.7045 3013.0654 3020.5594 3022.0908 3028.8228 3032.0139 3033.1242 3043.6014 3116.2120 3272.5807 3373.9657 3561.8761
redmass: 5.4568 3.9896 3.9779 5.7185 4.3772 6.5484 3.0118 6.4777 1.9260 4.9013 4.2938 3.3175 3.1114 2.1042 3.1632 3.4160 2.0278 2.7626 2.2933 1.2779 1.8466 1.2750 3.6659 2.8016 3.6410 1.8530 2.0064 1.9914 1.7730 1.6925 2.7514 2.6193 1.4754 2.5096 2.2192 1.9993 2.9187 2.9046 3.4864 2.7371 1.9372 1.1841 1.4393 2.6966 2.2299 1.8351 1.6216 1.5355 1.5147 1.4052 1.3708 1.2872 1.3063 1.2737 1.3466 1.3092 1.3086 1.3651 1.3708 1.5283 1.5038 1.4922 1.7145 1.4933 1.1464 1.1167 1.0935 1.0912 1.0905 1.0817 1.1480 1.7917 1.8386 6.4762 4.6339 1.0620 1.0632 1.0628 1.0641 1.0617 1.0630 1.0788 1.0974 1.0985 1.0637 1.0952 1.1016 1.1005 1.1034 1.1005 1.0638 1.0890 1.0787
irintensity: 0.2242 1.2894 0.3080 3.1148 2.0322 14.4942 1.5564 1.0655 0.7858 14.6589 0.0510 12.5399 1.5673 1.8149 10.8196 4.1300 0.4302 0.4100 12.5339 125.4120 25.2011 76.8062 38.2867 23.6495 6.9283 148.0614 70.6274 1.4283 0.6932 2.8489 0.1705 3.9603 7.0394 49.9894 11.3001 14.0232 7.3200 4.6654 60.8777 4.2025 2.2237 0.8065 1.5295 4.7712 0.5701 1.7751 11.5392 4.3495 10.6440 34.1005 21.8590 9.8163 19.9007 0.6491 28.6670 1.3141 9.7363 2.3304 5.0883 1.3988 0.1046 0.8697 140.6609 6.3968 19.4155 12.8373 5.3678 7.7245 5.9643 16.9288 22.6915 126.3316 44.5259 125.8078 209.0366 23.5922 37.6970 34.7916 25.9888 26.1802 20.8870 20.7227 68.5328 34.7175 14.0891 53.6066 32.8079 16.0488 131.6198 3.3928 11.7463 282.8433 25.8620
temp: 298.150 k
press: 1.00000 atm
elementType: 8 8 8 7 7 6 6 6 6 6 6 6 6 6 6 1 1 1 1 1 1 1 1 1 1 1 1 1 1 1 1 1 1
symmnumber: 1
zpe: 732143.5 jmol-1
zpe.correction: 0.278859 hartree
zpe.thermalcorrener: 0.294470 hartree
zpe.thermalcorrenthalpy: 0.295414 hartree
zpe.thermalcorrgfe: 0.234257 hartree
zpe.sumelectzpe: -725.831141 hartree
zpe.sumelectthermal: -725.815530 hartree
zpe.sumelectthermalent: -725.814586 hartree
zpe.sumelectthermalfe: -725.875742 hartree
dipole: 3.2379 -3.4913 -1.8984
dipole: 5.1262
quadrupole: -100.4429 -87.5278 -94.8784
quadrupole: 7.9012 -2.2042 3.5907
quadrupole: -6.1599 6.7552 -0.5953 7.9012 -2.2042 3.5907
hfenergy: -726.1099994 hartree
pointgroup: C01 [X(C10H18N2O3)]
dipole: 1.3028951 -1.1112817 -1.0653383 debye
polarizability: 151.9733767|-5.1664938|122.6940912|9.1550723|8.9582256|114.2123059 unknown
InChI: InChI=1S/C10H18N2O3/c13-9(11-7-10(14)12-15)6-8-4-2-1-3-5-8/h8,11-12,15H,1-7H2
charge 0 multiplicity 1
33 atoms
O  -0.790074 -1.241793 1.342858
O  -4.21773 0.775787 -0.797958
O  -3.231108 1.888997 1.445552
N  -1.498425 -1.427225 -0.85289
N  -2.87229 0.553793 1.052619
C  1.895023 -0.5234 0.176227
C  3.363363 -0.885215 -0.160244
C  1.550231 0.893031 -0.3517
C  4.353258 0.175877 0.377439
C  2.535849 1.956697 0.189143
C  4.001131 1.58976 -0.143875
C  0.926409 -1.598887 -0.381757
C  -0.50522 -1.406118 0.106616
C  -2.927945 -1.343582 -0.495589
C  -3.389709 0.072833 -0.114343
H  1.776683 -0.518142 1.279534
H  3.475893 -0.961053 -1.26336
H  3.610911 -1.882125 0.257104
H  0.513712 1.165209 -0.070815
H  1.594949 0.885264 -1.462572
H  5.38856 -0.093166 0.091203
H  4.317431 0.17759 1.486463
H  2.419161 2.031942 1.289803
H  2.284407 2.951135 -0.227162
H  4.691314 2.33948 0.288943
H  4.143914 1.619106 -1.244401
H  1.258649 -2.597597 -0.033562
H  0.969281 -1.60923 -1.489695
H  -1.240727 -1.467475 -1.839853
H  -3.117492 -2.032683 0.347255
H  -3.532296 -1.655054 -1.361131
H  -2.125628 0.10204 1.606093
H  -3.887486 2.136804 0.717256
