program: Gaussian 09
title: 000149502
version: EM64L-G09RevD.01
frameworkgroup: C1[X(C18H12O)]
method: RPBEPBE
basis: SDD
operation: Freq
keyword: #pfreq=noraman
keyword: PBEPBE/SDD
title: #p freq=noraman PBEPBE/SDD
converged: YES YES NO NO
title: Mulliken charges:
elementType: O C C C C C C C C C C C C C C C C C C H H H H H H H H H H H H
charge: -0.294171 -0.215596 0.212607 -0.352436 0.314195 0.009479 -0.026147 0.523984 -0.686691 0.455424 0.486343 -0.441338 -0.479826 -0.486870 -0.482822 -0.474567 -0.251261 -0.460502 -0.240553 0.244953 0.226949 0.231220 0.280659 0.244212 0.237045 0.250611 0.236973 0.242492 0.241236 0.226332 0.228067
chargesum: 0.00000
title: Mulliken charges with hydrogens summed into heavy atoms:
elementType: O C C C C C C C C C C C C C C C C C C
charge: -0.294171 0.029357 0.212607 0.105733 0.314195 0.009479 -0.026147 0.523984 -0.406032 0.455424 0.486343 -0.197126 -0.242781 -0.236259 -0.245849 -0.232075 -0.024929 -0.219266 -0.012486
polarizability: 2.66492816e+02 3.02037341e+01 2.74613685e+02 -1.71135949e+00 4.58604349e-01 8.57102855e+01
1716.lowfreq: -6.5531 -3.0653 -0.0004 0.0005 0.0009 9.1681 53.9250 72.9585 108.0086
frequency: 53.9121 72.9367 108.0076 153.3022 162.7768 220.4232 236.9604 261.9775 293.8990 358.0778 366.8679 409.6169 428.8553 452.9676 492.7754 493.9467 504.7135 532.8792 548.3971 578.5002 604.0003 615.8112 645.1005 707.8196 712.5251 733.1459 754.7193 772.4742 781.0432 784.0974 800.6077 838.3275 855.6227 866.1278 895.4694 905.1486 915.2267 948.0764 973.0913 978.2029 984.9015 989.6665 991.4127 1021.0686 1052.8164 1071.0002 1095.9491 1103.0342 1117.0520 1145.4922 1161.5685 1187.6438 1188.5651 1212.9883 1232.1830 1238.7796 1248.9345 1276.8622 1326.2838 1348.5621 1376.5399 1393.2839 1421.1070 1430.1343 1432.8719 1435.4074 1462.7956 1467.3934 1494.3433 1502.2530 1563.3126 1596.0269 1604.1786 1612.9376 1639.1327 3063.3984 3075.2521 3120.2784 3124.2759 3124.6140 3134.3286 3137.8749 3145.3281 3145.5026 3157.7478 3158.3795 3176.5905
redmass: 4.8180 3.5933 4.5461 4.7286 4.5940 4.3399 3.7042 4.3450 6.3903 4.5241 4.1192 7.2090 5.1393 4.7752 3.5468 4.7680 4.5320 3.4484 6.7044 3.2236 5.2399 4.6953 4.8637 5.2585 3.5925 2.0489 6.4460 4.4613 1.5206 1.3521 5.0057 4.5683 1.6432 4.4460 2.9650 1.4139 1.5603 1.6233 1.6142 1.5337 1.4389 7.1235 1.4316 1.1972 2.5279 2.1838 1.6940 1.3680 1.3327 1.8175 1.2925 1.2725 1.2781 1.9722 1.6565 1.8038 1.5596 2.0685 3.1553 2.1412 4.5580 2.4853 2.3635 4.8195 5.1707 2.5495 4.3906 1.2627 3.7633 5.2375 4.6367 7.6620 6.4651 6.6677 7.8255 1.0527 1.0884 1.0862 1.0860 1.0860 1.0918 1.0913 1.0934 1.0960 1.0991 1.0988 1.1199
irintensity: 2.4635 2.2079 2.0514 1.2465 5.3070 7.1550 1.1510 0.5468 2.4899 1.6150 1.8199 2.6735 3.2473 0.2642 1.1475 1.5704 4.0388 0.4047 3.1142 0.3414 3.3701 1.4294 0.8443 0.7181 2.7803 57.5752 6.6552 9.2186 9.5202 2.9174 9.1411 14.4092 84.6103 6.1840 17.6570 1.5915 21.1522 12.5213 3.6714 2.0849 8.4995 1.6807 1.2572 1.0140 3.4261 0.5489 12.4409 7.8417 2.2526 2.0523 2.6771 8.8132 3.6261 3.8180 13.8418 0.3637 3.8455 2.9858 0.8481 6.7904 8.6850 2.7358 3.6296 0.5304 3.1813 6.5261 4.5380 2.9337 0.1726 0.8342 0.1242 2.9445 12.5491 4.5387 0.8755 28.1257 17.9377 1.7473 0.5973 0.8914 11.7706 16.2881 20.0885 21.6449 71.5457 2.4843 26.1739
temp: 298.150 k
press: 1.00000 atm
elementType: 8 6 6 6 6 6 6 6 6 6 6 6 6 6 6 6 6 6 6 1 1 1 1 1 1 1 1 1 1 1 1
symmnumber: 1
zpe: 632875.3 jmol-1
zpe.correction: 0.241049 hartree
zpe.thermalcorrener: 0.254381 hartree
zpe.thermalcorrenthalpy: 0.255325 hartree
zpe.thermalcorrgfe: 0.201227 hartree
zpe.sumelectzpe: -767.071747 hartree
zpe.sumelectthermal: -767.058416 hartree
zpe.sumelectthermalent: -767.057472 hartree
zpe.sumelectthermalfe: -767.111569 hartree
dipole: -0.6636 1.8617 0.9199
dipole: 2.1801
quadrupole: -96.6248 -99.2438 -114.1976
quadrupole: 9.0908 2.9841 -1.4294
quadrupole: 6.7306 4.1116 -10.8422 9.0908 2.9841 -1.4294
hfenergy: -767.3127967 hartree
pointgroup: C01 [X(C18H12O1)]
dipole: 0.2083497 -0.7519035 0.3562138 debye
polarizability: 270.6818504|30.4547665|270.4016816|2.6960948|1.1643376|85.7332547 unknown
InChI: InChI=1S/C18H12O/c1-3-11-7-8-12-4-2-6-14-15(16-10-19-16)9-13(5-1)17(11)18(12)14/h1-9,16H,10H2
charge 0 multiplicity 1
31 atoms
O  -3.874714 1.97335 -0.206181
C  -3.25976 0.604841 -0.333454
C  -1.7680 0.526763 -0.20421
C  -4.144733 0.924543 0.84334
C  -1.121238 -0.779661 -0.142416
C  0.319334 -0.835259 -0.051995
C  1.093585 0.374945 -0.014397
C  0.429395 1.653545 -0.066843
C  -1.01059 1.68641 -0.168881
C  0.987556 -2.113958 0.007685
C  2.532083 0.317116 0.077456
C  -1.85514 -1.998292 -0.155845
C  2.432527 -2.144897 0.097747
C  1.208152 2.841768 -0.028934
C  3.174904 -0.97865 0.130653
C  0.213622 -3.305303 -0.019299
C  -1.192247 -3.243291 -0.096899
C  3.273138 1.529547 0.113665
C  2.615129 2.776894 0.060897
H  -3.705042 0.015303 -1.14761
H  -5.176421 0.552118 0.867389
H  -3.672204 1.119806 1.813722
H  -1.525941 2.651522 -0.224439
H  -2.948915 -1.976789 -0.202074
H  2.929431 -3.121273 0.140772
H  0.702931 3.81346 -0.07154
H  4.268487 -1.01688 0.198904
H  0.721384 -4.275781 0.025368
H  4.366401 1.48685 0.182916
H  -1.777142 -4.169523 -0.110088
H  3.20093 3.701976 0.088991
