program: Gaussian 09
title: 000149564
version: EM64L-G09RevD.01
frameworkgroup: C1[X(C21H20N4O3S)]
method: RPBEPBE
basis: SDD
operation: Freq
keyword: #p
keyword: freq=noraman
keyword: PBEPBE/SDD
title: #p freq=noraman PBEPBE/SDD
converged: YES YES NO NO
title: Mulliken charges:
elementType: S O O O N N N N C C C C C C C C C C C C C C C C C C C C C H H H H H H H H H H H H H H H H H H H H
charge: 0.862255 -0.309358 -0.616161 -0.676889 -0.446226 -0.013911 -0.307417 -0.669197 0.174743 0.345002 0.241434 -0.178367 -0.081577 0.266295 -0.514767 -0.395671 0.227260 -0.279958 0.443422 -0.309870 -0.300235 0.112739 -0.419999 -0.424325 -0.250847 -0.253319 -0.241210 -0.793924 -0.524286 0.351957 0.315701 0.228072 0.265796 0.267138 0.290702 0.246173 0.234066 0.268112 0.229232 0.234705 0.208486 0.304139 0.400385 0.253527 0.281370 0.240557 0.233642 0.231229 0.249373
chargesum: 0.00000
title: Mulliken charges with hydrogens summed into heavy atoms:
elementType: S O O O N N N N C C C C C C C C C C C C C C C C C C C C C
charge: 0.862255 -0.309358 -0.616161 -0.676889 -0.094269 -0.013911 -0.098931 0.035328 0.174743 0.345002 0.241434 -0.178367 -0.081577 0.266295 -0.199066 -0.167599 0.227260 -0.014162 0.443422 -0.042732 -0.009533 0.112739 -0.185933 -0.178153 0.017265 -0.024086 -0.006505 -0.018471 0.189959
polarizability: 7.76732920e+02 -2.69156536e+01 4.24744783e+02 -4.28756691e+00 2.28202458e+01 1.84631212e+02
1716.lowfreq: -7.7427 -3.4575 -0.0014 -0.0011 0.0009 4.2316 17.6426 28.1805 34.4535
frequency: 17.3528 28.1125 34.3942 40.8131 45.8556 50.8446 77.5017 81.8095 85.1892 100.0417 112.9679 118.5301 143.3414 156.5126 171.1382 184.6231 194.4029 201.6835 220.9543 239.8074 252.5941 259.5434 268.3360 296.2851 296.9889 342.1790 350.2435 359.3392 375.5692 385.9832 391.4127 406.2317 450.3090 458.9361 471.1832 478.5650 508.3890 522.1055 526.9878 531.0837 537.0555 548.6635 563.7065 586.8624 609.4513 626.5999 637.7016 659.1951 667.6891 679.1224 706.8683 715.6185 727.4078 749.7178 766.4300 768.8188 778.5063 794.0615 796.1346 824.3680 833.7726 835.3498 839.6451 866.2698 874.9537 876.2311 885.9893 908.8882 930.0429 934.6107 961.2196 973.1570 978.4272 980.1162 984.1563 989.3713 990.7552 1026.8108 1068.3748 1101.6281 1105.2189 1117.7056 1126.7081 1132.8888 1149.3196 1159.7352 1169.5158 1177.4741 1221.0678 1242.3397 1250.3572 1274.9967 1283.3920 1306.1743 1318.0103 1328.3042 1355.7197 1366.7835 1382.3380 1396.6953 1405.3507 1414.1111 1419.3893 1419.6587 1439.0564 1445.2738 1455.7436 1462.4235 1466.6095 1475.8089 1509.6030 1512.2495 1515.1413 1520.5155 1531.2253 1539.1642 1556.5460 1604.3697 1608.4716 1633.8362 1670.6464 2824.7870 2973.9962 3019.2642 3067.8661 3122.9885 3129.7780 3136.5023 3140.3359 3148.9150 3155.4087 3166.6386 3167.4077 3168.6549 3171.4090 3172.2508 3174.7146 3190.1086 3274.2588 3448.0055 3596.4547
redmass: 4.9793 4.7715 6.0024 8.8491 4.4858 5.1188 8.0816 5.7198 6.0108 4.1159 4.7344 4.5652 4.7664 4.0596 2.7602 1.4386 2.0422 4.1991 4.0332 4.4906 2.4452 2.7373 4.8912 5.3354 6.0743 4.9068 6.1766 8.2306 4.7702 4.3723 4.5267 3.6545 3.3612 4.8478 4.5437 3.0249 7.2919 1.1891 6.7723 5.1252 5.4806 3.1937 4.6341 3.8499 3.7887 5.2871 4.5761 4.0452 12.0074 2.8569 5.4031 3.4149 2.2580 3.6801 1.7231 1.4029 3.0828 2.9253 10.7692 4.4017 1.5115 1.5553 1.7155 2.7764 3.8327 2.2137 1.9080 3.8710 1.2525 1.3049 1.3689 1.3833 1.3106 2.0341 1.3768 3.8156 1.3729 2.0797 3.9065 1.8647 1.6899 1.2599 1.4458 1.6981 1.2391 1.2512 1.1617 2.2066 1.5443 1.7852 2.1769 1.1431 1.6429 2.0286 2.9394 2.1163 2.2010 2.9944 4.4160 3.1643 3.0256 1.0582 8.0888 1.0671 1.4591 2.5273 3.1644 3.2426 1.0496 1.1144 4.3863 4.4959 4.9061 4.4860 5.1234 5.9148 3.2116 5.8217 6.3958 4.8731 1.2058 1.0864 1.0322 1.0242 1.1047 1.0859 1.0890 1.1007 1.0892 1.0913 1.0943 1.0962 1.1069 1.0884 1.1065 1.0997 1.0916 1.0985 1.0751 1.0744 1.0814
irintensity: 2.0086 0.3991 1.1845 2.4841 3.3761 2.2885 5.9938 4.0878 9.8857 0.2027 3.7177 0.1245 2.7679 3.6204 1.3079 0.2668 4.7353 1.5209 1.9415 2.1983 0.8766 0.4211 2.7259 0.3294 15.9902 5.5924 5.3198 9.7473 3.5422 7.7370 1.6702 7.0403 4.9531 12.1523 10.7327 4.6183 14.8032 68.5630 43.8042 7.0311 7.7374 18.0597 10.7824 7.3820 25.7878 4.7980 8.9798 12.0342 7.2465 18.3202 4.9005 13.2130 53.3567 0.2838 63.5536 17.0973 11.8644 8.8657 52.7958 6.9779 23.8670 26.2963 75.2587 4.4227 1.2868 2.1314 5.3275 2.0183 3.2097 11.8154 1.4467 2.0820 9.6412 21.9969 53.1504 36.7021 2.2352 9.6946 23.2304 20.4753 37.5453 0.1709 1.6244 62.0283 42.4909 15.7224 17.2567 153.5891 11.2998 16.1802 29.8419 18.2180 4.0205 1.2377 39.3031 113.7574 14.3715 39.2573 19.2995 69.0928 68.9460 9.0994 4.0374 10.3769 10.1634 29.9589 14.2075 27.8386 15.9100 20.6799 21.8087 21.3049 13.1488 66.9401 71.8411 10.1198 34.0068 26.4195 92.1599 43.2285 50.3201 21.2268 52.8183 26.3812 29.3025 1.3894 12.4148 14.0074 7.7102 5.6157 20.3416 14.5376 6.1437 0.5140 5.0490 45.2482 1.6868 1.7068 9.6904 92.7314 89.3983
temp: 298.150 k
press: 1.00000 atm
elementType: 16 8 8 8 7 7 7 7 6 6 6 6 6 6 6 6 6 6 6 6 6 6 6 6 6 6 6 6 6 1 1 1 1 1 1 1 1 1 1 1 1 1 1 1 1 1 1 1 1
symmnumber: 1
zpe: 972214.5 jmol-1
zpe.correction: 0.370297 hartree
zpe.thermalcorrener: 0.397699 hartree
zpe.thermalcorrenthalpy: 0.398643 hartree
zpe.thermalcorrgfe: 0.311113 hartree
zpe.sumelectzpe: -1652.777975 hartree
zpe.sumelectthermal: -1652.750573 hartree
zpe.sumelectthermalent: -1652.749629 hartree
zpe.sumelectthermalfe: -1652.837159 hartree
dipole: -3.1448 6.9167 -3.9256
dipole: 8.5522
quadrupole: -189.4347 -145.5113 -179.7141
quadrupole: 13.3340 -19.1999 -6.8330
quadrupole: -17.8813 26.0421 -8.1608 13.3340 -19.1999 -6.8330
hfenergy: -1653.148272 hartree
pointgroup: C01 [X(C21H20N4O3S1)]
dipole: -0.4941218 1.9279456 -2.7129489 debye
polarizability: 713.2992236|-143.7660171|449.7815515|-3.6310439|-95.2196415|223.0281392 unknown
InChI: InChI=1S/C20H17N4O.CH3O2S/c1-25-19-11-13(22)7-9-18(19)24-20-14-4-2-3-5-16(14)23-17-8-6-12(21)10-15(17)20;1-4(2)3/h2-11,22,24H,21H2,1H3;1H3
charge 0 multiplicity 1
49 atoms
S  4.327069 -2.456776 0.545188
O  1.370243 1.844053 -2.557598
O  4.478831 -3.705396 1.631375
O  2.685486 -2.162756 0.146061
N  -0.478387 1.196474 -0.794593
N  -4.080284 -0.562705 0.751043
N  4.832412 0.474718 0.752848
N  0.625844 -3.55884 1.186306
C  -1.627982 0.607699 -0.21509
C  -1.609661 -0.714285 0.368547
C  -2.867894 1.322325 -0.331051
C  -2.899282 -1.223196 0.865224
C  -4.08053 0.679363 0.149741
C  0.825633 1.160088 -0.34775
C  -0.47439 -1.556829 0.438904
C  -2.970837 2.648586 -0.872926
C  1.874973 1.428014 -1.316717
C  -2.930801 -2.535232 1.476224
C  -0.526425 -2.830514 1.064102
C  -5.336364 1.356351 0.019979
C  1.191194 0.849302 0.998741
C  3.585012 0.779036 0.339828
C  -1.795272 -3.314697 1.582879
C  3.208654 1.232615 -0.996715
C  2.520382 0.637799 1.327345
C  -4.211975 3.280854 -0.989032
C  -5.408295 2.628949 -0.549244
C  4.881658 -3.2889 -1.115624
C  2.331671 2.108582 -3.632799
H  -0.601691 1.651199 -1.708537
H  0.499042 -1.254439 0.049821
H  -2.065782 3.192961 -1.166366
H  -3.903453 -2.879257 1.840837
H  -6.224034 0.834335 0.3902
H  0.404612 0.723697 1.746214
H  4.000207 1.386637 -1.737896
H  -1.837461 -4.303654 2.05485
H  2.824226 0.356499 2.339177
H  -4.269397 4.293499 -1.40337
H  -6.372365 3.139471 -0.644329
H  5.530639 0.5793 -0.019169
H  0.623543 -4.474084 1.635399
H  1.536466 -3.135884 0.846571
H  5.941338 -3.561288 -1.003884
H  4.237929 -4.173871 -1.218002
H  4.711741 -2.562201 -1.922967
H  2.899725 1.19262 -3.881255
H  3.027787 2.919254 -3.346121
H  1.726047 2.420125 -4.495568
