program: Gaussian 09
title: 000149503
version: EM64L-G09RevD.01
frameworkgroup: C1[X(C10H20N2O3)]
method: RPBEPBE
basis: SDD
operation: Freq
keyword: #p
keyword: freq=noraman
keyword: PBEPBE/SDD
title: #p freq=noraman PBEPBE/SDD
converged: YES YES NO NO
title: Mulliken charges:
elementType: O O O N N C C C C C C C C C C H H H H H H H H H H H H H H H H H H H H
charge: -0.318400 -0.331173 -0.378823 -0.364421 -0.305377 -0.363628 -0.373514 -0.373565 -0.351590 -0.535102 -0.356096 0.285750 -0.695105 -0.472246 0.271371 0.190027 0.193717 0.190667 0.195630 0.241117 0.202342 0.186943 0.189784 0.237642 0.208883 0.196812 0.195049 0.210502 0.216781 0.209285 0.317087 0.264620 0.248221 0.393610 0.373199
chargesum: 0.00000
title: Mulliken charges with hydrogens summed into heavy atoms:
elementType: O O O N N C C C C C C C C C C
charge: -0.318400 -0.331173 -0.005624 -0.047334 0.088233 0.020117 0.012783 0.069895 0.025137 -0.088577 0.035765 0.285750 -0.058537 0.040594 0.271371
polarizability: 1.82409207e+02 3.15483937e+00 1.24694301e+02 3.79714007e+00 2.62429672e+00 1.02506338e+02
1716.lowfreq: -4.7025 -0.0003 0.0008 0.0012 2.2743 6.0357 14.5085 25.8946 30.9554
frequency: 13.9830 25.2112 30.9057 55.6254 62.5471 80.0395 90.8992 111.1521 125.3668 138.7233 153.1678 180.6691 212.2201 223.6746 230.6642 253.8068 301.7515 324.5049 361.8151 414.4117 432.0332 461.5702 483.6738 546.9164 579.2803 623.9339 684.5270 721.7801 728.1961 732.2437 758.5109 772.5966 823.4135 850.3754 889.2046 906.6813 914.2012 958.6528 988.9757 993.4566 1028.2029 1029.2840 1041.2680 1061.6129 1075.6315 1080.8128 1115.0918 1118.0467 1186.7000 1211.0007 1222.3995 1229.8681 1249.2296 1261.7252 1265.7888 1278.3085 1283.9867 1292.4996 1296.7803 1317.6706 1332.2914 1342.5950 1353.2070 1355.3119 1359.1341 1389.0535 1434.1153 1451.0493 1462.2195 1462.9640 1469.1894 1476.3878 1477.3467 1479.4192 1484.4611 1488.4773 1495.6224 1572.9760 1600.0112 2951.1384 2951.7636 2959.5445 2968.3482 2972.1400 2977.8763 2984.3650 2987.4697 2997.4960 3015.5366 3022.1766 3031.8315 3037.8634 3062.4702 3068.5098 3071.7159 3116.2595 3275.1666 3374.9575 3561.4091
redmass: 4.8014 2.2424 3.6065 3.3320 4.9453 3.2965 2.2911 4.7201 2.1179 2.0695 3.9177 7.4091 3.7694 5.7289 1.1150 3.4076 4.2699 4.8242 3.1458 3.3168 2.6101 1.8901 1.7432 1.3370 2.5056 3.8111 4.8759 1.0633 1.5022 1.0964 1.3104 2.0118 1.3172 2.8345 1.8736 1.3170 3.8398 3.4592 3.4429 1.3633 3.1618 3.5742 3.4287 2.4789 2.4213 2.1904 1.7254 2.4576 1.7365 1.4439 1.3348 1.4901 1.5007 1.3208 1.2813 1.1579 1.1332 1.0922 1.2020 1.4043 1.2814 1.4474 1.5617 1.6753 1.6866 1.2168 1.1489 1.1103 1.0725 1.0705 1.0730 1.0722 1.0503 1.9379 1.0845 1.0941 1.8224 6.5453 4.6929 1.0591 1.0589 1.0593 1.0589 1.0364 1.0614 1.0675 1.0904 1.0980 1.1021 1.0633 1.1008 1.1036 1.1039 1.1007 1.0993 1.1005 1.0639 1.0889 1.0787
irintensity: 1.0846 0.1325 0.5622 0.2023 2.3586 3.0812 0.5612 1.6721 1.1884 0.5550 11.1650 1.5898 0.1666 11.5286 0.0227 17.1610 5.0666 12.8092 12.9760 10.1333 6.6599 32.4974 89.9356 64.5820 63.7082 12.0420 4.4177 13.1667 150.6083 12.4600 15.5353 27.4486 2.9853 5.6230 6.4879 1.3065 63.1002 13.8020 2.7574 1.2514 5.9232 51.1266 10.3409 5.4349 2.5735 0.1128 6.6404 14.1592 2.7387 2.2978 11.3177 21.3355 47.3899 35.6112 7.1518 9.0796 7.6266 0.2036 1.0306 18.2946 3.5249 12.3439 0.3346 0.2264 162.1554 11.3886 24.2084 7.4793 0.1832 0.0918 1.7616 6.8853 8.0340 143.3043 4.4842 30.7694 49.8924 132.4572 215.5419 0.9014 3.9421 21.8207 104.2579 37.1033 5.7034 43.2431 14.7595 4.3555 1.6717 15.7430 34.0888 39.3149 61.3629 104.2720 54.6031 3.5215 10.8122 314.5440 26.6753
temp: 298.150 k
press: 1.00000 atm
elementType: 8 8 8 7 7 6 6 6 6 6 6 6 6 6 6 1 1 1 1 1 1 1 1 1 1 1 1 1 1 1 1 1 1 1 1
symmnumber: 1
zpe: 782125.3 jmol-1
zpe.correction: 0.297896 hartree
zpe.thermalcorrener: 0.316180 hartree
zpe.thermalcorrenthalpy: 0.317125 hartree
zpe.thermalcorrgfe: 0.248071 hartree
zpe.sumelectzpe: -727.000621 hartree
zpe.sumelectthermal: -726.982336 hartree
zpe.sumelectthermalent: -726.981392 hartree
zpe.sumelectthermalfe: -727.050445 hartree
dipole: 4.4450 -3.2590 -0.5222
dipole: 5.5364
quadrupole: -119.0531 -91.8795 -92.2526
quadrupole: 5.1587 -3.1758 -1.3913
quadrupole: -17.9914 9.1822 8.8091 5.1587 -3.1758 -1.3913
hfenergy: -727.2985165 hartree
pointgroup: C01 [X(C10H20N2O3)]
dipole: -1.7975032 1.1932957 -0.299291 debye
polarizability: 182.0288448|4.902928|124.3408871|-4.743042|-4.748957|103.2401138 unknown
InChI: InChI=1S/C10H20N2O3/c1-2-3-4-5-6-7-9(13)11-8-10(14)12-15/h11-12,15H,2-8H2,1H3
charge 0 multiplicity 1
35 atoms
O  1.638118 -0.628597 0.794422
O  5.625105 0.918697 -0.636864
O  5.302425 -1.726728 -0.25129
N  2.179989 1.369148 -0.243008
N  4.339466 -0.776724 0.234425
C  -2.55022 0.031924 -0.551577
C  -3.767039 -0.044715 0.398092
C  -1.212591 0.205803 0.200025
C  -5.104572 -0.268241 -0.343135
C  -0.00433 0.32309 -0.765041
C  -6.32517 -0.323542 0.603802
C  1.322897 0.310027 -0.015164
C  -7.656016 -0.558885 -0.142773
C  3.463258 1.497788 0.475292
C  4.557814 0.543145 -0.03153
H  -2.69423 0.872768 -1.262539
H  -2.50592 -0.891772 -1.165783
H  -3.828944 0.890791 0.992505
H  -3.610906 -0.866367 1.127714
H  -1.03852 -0.65674 0.870343
H  -1.260138 1.106939 0.844069
H  -5.255338 0.543395 -1.085854
H  -5.049312 -1.213186 -0.923238
H  -0.010383 -0.55048 -1.446078
H  -0.100879 1.230529 -1.392636
H  -6.170566 -1.129312 1.3503
H  -6.383822 0.623819 1.177805
H  -7.633552 -1.514006 -0.700892
H  -8.511981 -0.596134 0.55588
H  -7.850087 0.250254 -0.872166
H  1.940272 2.066008 -0.949481
H  3.280821 1.312246 1.54937
H  3.845372 2.521598 0.343994
H  3.459971 -1.171829 0.606583
H  5.998111 -1.11251 -0.652672
