program: Gaussian 09
title: 000149516
version: EM64L-G09RevD.01
frameworkgroup: C1[X(C21H17N4)]
method: RPBEPBE
basis: SDD
operation: Freq
keyword: #p
keyword: freq=noraman
keyword: PBEPBE/SDD
title: #p freq=noraman PBEPBE/SDD
converged: YES YES NO NO
title: Mulliken charges:
elementType: N N N N C C C C C C C C C C C C C C C C C C C C C H H H H H H H H H H H H H H H H H
charge: -0.190856 -0.050015 0.008217 0.004483 0.069348 0.249378 0.203737 0.268212 0.330040 -0.378251 0.207661 -0.504688 -0.353255 -0.328844 -0.363548 -0.660387 0.260505 -0.358846 -0.248962 -0.219582 -0.357203 -0.353617 -0.216666 -0.214102 -0.220709 0.280399 0.253714 0.289513 0.243421 0.276001 0.244266 0.249236 0.256688 0.245774 0.269530 0.262162 0.260668 0.257372 0.259500 0.255614 0.256426 0.257664
chargesum: 1.00000
title: Mulliken charges with hydrogens summed into heavy atoms:
elementType: N N N N C C C C C C C C C C C C C C C C C C C C C
charge: -0.190856 -0.050015 0.008217 0.004483 0.069348 0.249378 0.203737 0.268212 0.330040 0.155862 0.207661 -0.215175 -0.109834 -0.052843 -0.119282 0.091311 0.260505 -0.089316 0.013199 0.041086 -0.099830 -0.094117 0.038948 0.042323 0.036955
polarizability: 4.60755607e+02 -2.60126650e+01 2.77360412e+02 1.08795320e+00 -2.69787861e+00 1.40331250e+02
1716.lowfreq: -8.8478 -4.4719 -0.0006 -0.0004 0.0005 1.4314 24.8079 36.4391 53.7356
frequency: 24.7302 36.3786 53.7254 60.9269 69.9610 89.2273 96.8679 117.8279 128.5017 185.9910 188.2375 197.8152 215.2653 242.5796 258.4182 286.1099 296.6118 326.6439 377.4655 394.2713 400.1073 421.9646 435.9062 449.8823 464.3124 485.7843 500.4656 516.4278 540.7546 553.1111 605.9090 606.7849 624.9660 627.3112 642.1734 680.3655 695.5871 706.2195 718.7205 729.1886 754.3517 775.8311 786.2944 791.0003 804.2621 840.1356 864.4078 870.5526 886.3376 890.5826 919.8748 940.2322 968.5585 973.1714 983.8772 986.2412 989.8741 990.0128 1014.4485 1015.9223 1022.3783 1038.4692 1044.8162 1083.6339 1087.3345 1099.5103 1119.4328 1124.3079 1167.9358 1183.8557 1184.7642 1193.7015 1195.3520 1223.0726 1256.2027 1277.0087 1293.7126 1315.8176 1329.1885 1345.3977 1347.9607 1368.0295 1379.1457 1384.4898 1398.7682 1403.7142 1427.0022 1430.6031 1444.5377 1455.0878 1469.3374 1476.5005 1483.2947 1492.4454 1503.7320 1528.8922 1551.7113 1570.9079 1580.4867 1603.7297 1614.2642 1626.2843 2053.0674 3004.8504 3056.3441 3101.6304 3104.6826 3128.6877 3135.9042 3136.5250 3151.1979 3153.0129 3153.8532 3163.8322 3165.2554 3175.1932 3179.0693 3183.5594 3187.8787 3208.0028
redmass: 4.3445 4.5104 5.7804 5.7078 3.9327 4.4302 7.5729 4.1600 3.3721 1.1555 4.2650 7.0021 3.9898 4.3329 5.3331 4.7155 5.7084 4.5735 3.3477 2.8622 4.8356 5.2315 3.7768 3.2513 12.3580 4.3798 3.5385 5.9239 4.0020 4.6499 5.4140 4.3302 4.9525 6.4093 6.2025 6.0366 4.2054 2.7936 2.7577 3.1169 3.0600 1.8862 1.6483 2.2605 1.5183 1.6970 1.2662 3.5149 1.5337 1.6826 5.6037 1.4025 2.7724 1.3901 1.3676 5.3504 5.9943 1.4913 1.3337 1.3721 2.8509 2.5647 2.3107 1.7408 1.8484 2.6688 2.9338 1.9066 1.5307 1.0549 1.9712 1.1501 1.1214 2.1809 1.4605 1.4365 1.6448 1.4059 2.7890 1.5693 2.2660 6.1064 3.5529 3.1942 1.2269 3.6872 5.5845 2.1618 3.9121 3.2204 1.0491 2.3265 1.0883 2.7866 1.1520 3.2631 7.8208 7.6101 5.7641 5.9382 5.8272 6.4662 13.9698 1.0362 1.0648 1.0996 1.0991 1.1015 1.0894 1.0889 1.0898 1.0911 1.0883 1.0960 1.0900 1.0962 1.1016 1.0958 1.0981 1.0917
irintensity: 0.2716 0.0069 0.0037 0.0492 0.7922 0.1026 0.2551 0.5857 0.3675 0.3734 0.3932 0.1014 2.8489 0.5110 0.1877 0.0603 2.8037 0.5431 0.8124 0.0728 3.9985 1.2205 3.6041 1.6166 1.1348 2.2082 2.7640 4.8017 2.1542 4.0021 2.5989 7.1558 2.7486 5.2202 6.2571 0.4521 7.5011 33.1493 18.2582 16.1424 12.6144 48.5110 54.1633 14.3351 4.3481 26.6323 0.4215 7.1212 17.2411 9.0869 4.9719 1.1315 7.0177 0.0450 0.1002 12.2122 1.4750 0.2001 0.0721 0.3117 14.3010 0.4930 6.8787 14.4869 12.3947 2.5841 2.4161 1.7654 14.5612 0.0046 2.0220 17.3986 0.6038 5.4930 43.0928 15.8722 21.4846 1.5966 80.7792 45.3092 174.4899 0.3801 29.3743 24.8567 22.1814 21.9077 64.6434 14.9802 18.2228 124.4331 24.6908 61.6122 4.2076 74.1477 33.0418 16.8427 35.2209 47.7087 2.4241 5.6389 88.7202 244.2205 813.4041 7.5459 7.5066 10.0109 12.2352 7.9687 1.6775 1.3369 1.5325 1.7514 0.5149 8.3037 0.7372 1.8957 9.3062 3.9400 7.8131 0.3570
temp: 298.150 k
press: 1.00000 atm
elementType: 7 7 7 7 6 6 6 6 6 6 6 6 6 6 6 6 6 6 6 6 6 6 6 6 6 1 1 1 1 1 1 1 1 1 1 1 1 1 1 1 1 1
symmnumber: 1
zpe: 865311.8 jmol-1
zpe.correction: 0.329580 hartree
zpe.thermalcorrener: 0.349990 hartree
zpe.thermalcorrenthalpy: 0.350934 hartree
zpe.thermalcorrgfe: 0.279570 hartree
zpe.sumelectzpe: -1027.488930 hartree
zpe.sumelectthermal: -1027.468520 hartree
zpe.sumelectthermalent: -1027.467576 hartree
zpe.sumelectthermalfe: -1027.538940 hartree
dipole: -2.9984 1.1149 -0.1104
dipole: 3.2009
quadrupole: -92.8724 -102.6778 -137.7203
quadrupole: 9.5062 -1.0074 -0.5612
quadrupole: 18.2177 8.4124 -26.6302 9.5062 -1.0074 -0.5612
hfenergy: -1027.8185099 hartree
pointgroup: C01 [X(C21H17N4)]
dipole: 1.1970266 0.384362 0.0725985 debye
polarizability: 462.556417|17.5640428|275.243559|7.379535|5.5949285|140.6472936 unknown
InChI: InChI=1S/C21H17N4/c1-2-25-20-14-16(23-24-22)12-13-18(20)17-10-6-7-11-19(17)21(25)15-8-4-3-5-9-15/h3-14H,2H2,1H3
charge 1 multiplicity 1
42 atoms
N  0.102418 -0.853705 -0.155488
N  -4.727688 -1.315622 -0.297662
N  -5.925017 -0.880773 -0.290627
N  -7.093425 -0.708363 -0.306006
C  1.25374 -0.121393 -0.071501
C  -1.187479 -0.240512 -0.12561
C  1.203679 1.311513 0.047135
C  -1.281128 1.190946 -0.008349
C  -0.071184 1.990176 0.083345
C  0.178688 -2.358352 -0.258728
C  2.576589 -0.825017 -0.105579
C  -2.358084 -1.032199 -0.217632
C  -2.587675 1.76854 0.009074
C  2.420397 2.066842 0.134709
C  -0.07743 3.410591 0.207501
C  -0.076083 -3.06016 1.089061
C  -3.628361 -0.424775 -0.198669
C  -3.742762 0.995988 -0.083149
C  2.380205 3.456829 0.253758
C  1.122503 4.12878 0.290474
C  3.178672 -1.269318 1.100233
C  3.258023 -0.993364 -1.340177
C  4.443793 -1.897018 1.066096
C  4.520641 -1.626022 -1.366386
C  5.113828 -2.081179 -0.165581
H  1.182503 -2.607611 -0.628951
H  -0.540727 -2.674957 -1.030986
H  -2.330693 -2.118304 -0.300194
H  -2.695992 2.852166 0.094477
H  3.3790 1.542449 0.108259
H  -1.020893 3.960726 0.24044
H  -1.051791 -2.795956 1.528806
H  -0.057947 -4.152424 0.930944
H  0.713524 -2.813335 1.818323
H  -4.727843 1.474103 -0.067418
H  3.308262 4.031927 0.320398
H  1.095106 5.219079 0.385554
H  2.673557 -1.109892 2.059708
H  2.806893 -0.632416 -2.271522
H  4.905656 -2.23516 1.999125
H  5.0408 -1.756727 -2.32061
H  6.094026 -2.567902 -0.188996
