program: Gaussian 09
title: 000102997
version: EM64L-G09RevD.01
frameworkgroup: C1[X(C21H20N2O6)]
method: RPBEPBE
basis: SDD
operation: Freq
keyword: #p
keyword: freq=noraman
keyword: PBEPBE/SDD
title: #p freq=noraman PBEPBE/SDD
converged: YES YES NO NO
title: Mulliken charges:
elementType: O O O O O O N N C C C C C C C C C C C C C C C C C C C C C H H H H H H H H H H H H H H H H H H H H
charge: -0.184299 -0.288300 -0.179073 -0.181132 -0.199033 -0.293591 -0.127363 -0.382396 -0.193856 -0.601223 -0.500295 -0.502525 0.448503 0.266906 0.215325 0.244814 -0.432075 -0.369389 0.300091 -0.228349 -0.237033 -0.243076 -0.477290 0.506900 -0.355038 -0.432298 -0.234728 -0.221732 -0.244066 0.308794 0.232604 0.254593 0.271173 0.272608 0.274121 0.270655 0.360877 0.241797 0.270736 0.228564 0.236880 0.229993 0.223089 0.253250 0.275267 0.228938 0.243050 0.223858 0.224773
chargesum: 0.00000
title: Mulliken charges with hydrogens summed into heavy atoms:
elementType: O O O O O O N N C C C C C C C C C C C C C C C C C C C C C
charge: -0.184299 -0.288300 -0.179073 -0.181132 -0.199033 -0.293591 -0.127363 -0.021518 0.114939 -0.114026 0.043485 0.042251 0.448503 0.266906 0.215325 0.244814 -0.190279 -0.098653 0.300091 0.000215 -0.000153 -0.013083 -0.000951 0.506900 -0.079770 -0.203360 0.008323 0.002126 -0.019293
polarizability: 2.58001745e+02 3.98722835e+00 2.73425209e+02 5.38402603e+00 1.32329655e+00 2.19069873e+02
1716.lowfreq: -6.7883 -0.0009 -0.0007 -0.0005 1.5128 4.6937 15.2915 16.8664 29.5500
frequency: 15.2475 16.5809 29.4623 34.1139 42.4905 45.4238 49.0242 57.5113 61.4121 68.2237 72.2554 83.1343 89.6639 119.9815 127.7731 154.3931 168.4712 191.9891 218.6943 249.5513 278.0647 296.1749 310.1737 324.6139 357.1281 371.3214 403.5310 405.9831 411.5799 422.3040 481.2461 486.5417 513.1119 534.4538 544.6793 553.1544 555.8286 580.2784 588.0407 598.2249 615.5608 617.1022 624.1266 633.5183 654.1667 691.1252 701.3133 707.7853 711.6569 736.8762 754.1198 755.4344 764.2788 811.1958 812.1301 818.7092 859.0248 862.5608 866.3348 921.0673 928.2628 934.0559 966.9781 977.7425 981.2703 983.5495 988.4165 989.6476 990.9707 1001.6216 1003.2623 1006.2469 1007.9367 1017.4812 1025.2828 1026.7211 1029.5480 1060.8225 1092.7346 1094.7282 1145.5060 1148.0051 1165.0245 1171.2283 1173.5998 1187.8461 1190.9851 1195.3751 1209.2197 1210.1484 1219.8419 1228.7005 1232.6074 1241.2550 1250.0443 1293.6586 1295.4532 1325.0977 1329.9678 1339.0936 1342.9989 1355.6485 1382.9392 1386.3217 1437.4433 1440.4641 1441.2911 1453.1882 1461.2712 1467.5238 1475.6311 1483.8119 1485.4247 1592.0252 1594.0978 1612.7767 1614.3620 1646.0155 1659.0527 1689.5887 1722.9297 3012.0670 3024.5161 3027.3074 3030.0100 3038.6242 3073.7941 3085.3222 3102.0537 3102.5187 3114.9083 3117.4831 3127.7392 3129.8997 3140.4165 3145.0078 3150.7879 3153.3663 3165.8685 3168.2234 3546.6866
redmass: 6.0437 5.6300 5.0236 5.3846 6.2034 4.8950 5.8006 6.5884 4.6371 6.9911 5.9435 3.8068 2.8511 9.8289 6.2374 5.9525 5.3468 5.6376 5.7922 6.2883 6.4422 11.6220 8.3300 3.0761 2.7956 4.2445 2.8340 2.8502 4.7714 3.4771 4.1661 5.0553 4.5089 3.5950 3.9092 3.0778 4.6934 4.5277 1.8869 5.6442 5.3189 6.2069 2.9277 6.2422 4.6350 5.6843 4.3742 2.4409 1.9282 3.3064 2.1573 3.7658 3.8355 3.4630 3.3517 1.4888 1.4658 1.2708 3.3366 1.6062 1.7645 1.5095 3.7673 2.5856 1.3984 1.5259 3.6270 5.1000 4.1166 1.6212 1.5923 2.1676 1.8802 5.4981 2.1636 2.4710 3.1671 3.4491 1.5756 1.7518 2.5460 1.2077 5.1773 1.1265 1.0776 1.4416 1.3066 1.1804 2.3084 1.1294 2.5995 2.7307 1.5692 1.2154 1.7109 2.3300 1.4865 1.2622 1.3498 1.3094 1.2481 1.3415 6.9725 6.7473 1.0771 2.1560 2.1312 1.0897 1.1374 1.1534 1.8021 2.3098 2.2230 5.8662 6.0596 6.0137 6.1395 8.8121 12.3430 12.5909 12.4788 1.0627 1.0597 1.0803 1.0594 1.0632 1.1033 1.1035 1.1019 1.1056 1.0868 1.0872 1.0887 1.0869 1.0916 1.0915 1.0963 1.0958 1.1015 1.1003 1.0777
irintensity: 0.1187 0.0879 0.3109 0.5373 0.0603 1.2266 0.6470 0.2507 0.3241 4.3280 5.6248 1.7539 3.0161 5.8394 0.6889 1.3421 2.0847 3.0104 5.1911 8.8871 0.4204 0.8563 1.1296 9.4539 11.0493 11.9107 0.7355 0.3797 10.3703 1.6030 29.3164 3.0766 13.0491 0.3494 1.3765 1.4995 12.0795 2.7743 94.6065 6.1765 4.0299 1.0462 43.3786 53.6254 15.8923 33.7614 19.1309 52.8200 88.6458 18.2807 81.5310 12.2605 24.9290 18.6334 1.1290 16.4653 1.0839 4.1337 23.5423 31.5752 33.4083 2.4919 77.2008 59.5376 2.2251 0.6831 71.3963 42.4741 5.7955 24.1617 36.4842 1.1878 49.6854 5.5529 6.2031 17.6055 32.7619 43.7527 11.2251 7.7962 34.7473 3.3496 192.9805 12.9688 1.2677 58.8522 11.0219 2.2677 139.6738 3.8839 20.9045 60.4350 68.2127 8.8675 52.3516 40.0268 1.9578 6.0358 1.4116 18.7605 21.0780 14.2096 0.0549 0.5314 0.8006 16.1226 12.3831 27.8291 9.6500 90.9057 400.9039 21.2807 11.3972 0.9336 1.2791 0.8627 1.3026 121.1218 744.4716 155.7836 30.5083 16.7403 36.3948 8.1920 10.5621 1.0346 7.6735 0.1069 4.1508 8.5379 6.6560 6.1079 11.7585 2.1087 19.8302 22.9900 16.2784 24.7665 22.1254 11.7456 74.0646
temp: 298.150 k
press: 1.00000 atm
elementType: 8 8 8 8 8 8 7 7 6 6 6 6 6 6 6 6 6 6 6 6 6 6 6 6 6 6 6 6 6 1 1 1 1 1 1 1 1 1 1 1 1 1 1 1 1 1 1 1 1
symmnumber: 1
zpe: 985072.5 jmol-1
zpe.correction: 0.375194 hartree
zpe.thermalcorrener: 0.401743 hartree
zpe.thermalcorrenthalpy: 0.402688 hartree
zpe.thermalcorrgfe: 0.313393 hartree
zpe.sumelectzpe: -1370.988365 hartree
zpe.sumelectthermal: -1370.961816 hartree
zpe.sumelectthermalent: -1370.960872 hartree
zpe.sumelectthermalfe: -1371.050166 hartree
dipole: -0.8699 1.7355 3.1268
dipole: 3.6805
quadrupole: -174.7833 -130.3339 -169.0070
quadrupole: 2.8540 7.3878 6.4898
quadrupole: -16.7419 27.7075 -10.9656 2.8540 7.3878 6.4898
hfenergy: -1371.3635596 hartree
pointgroup: C01 [X(C21H20N2O6)]
dipole: 0.4793611 0.1214676 -1.3609435 debye
polarizability: 258.7807621|3.8432152|268.4507381|-1.8867985|-15.7127315|223.2653264 unknown
InChI: InChI=1S/C21H20N2O6/c24-18-11-12-19(25)23(18)29-20(26)17(13-15-7-3-1-4-8-15)22-21(27)28-14-16-9-5-2-6-10-16/h1-10,17,22H,11-14H2
charge 0 multiplicity 1
49 atoms
O  1.025838 0.485447 -0.003355
O  -2.575225 -1.132113 1.050273
O  2.590274 0.813454 1.739295
O  -0.128409 3.142005 -0.062953
O  3.585247 0.557037 -1.396928
O  -1.491804 0.135376 2.728219
N  1.617875 1.628823 -0.615997
N  -0.33827 -1.380374 1.365981
C  0.962809 -1.052238 1.922625
C  1.929605 -2.287671 1.920796
C  1.875831 3.827452 -1.409238
C  3.120522 2.988995 -1.807917
C  1.983339 -3.042366 0.59851
C  1.643781 0.168071 1.279514
C  0.962972 2.892939 -0.607799
C  2.870593 1.572727 -1.28375
C  1.239409 -4.241086 0.436111
C  2.757474 -2.566218 -0.492184
C  -1.467471 -0.711955 1.795779
C  1.268313 -4.952591 -0.785462
C  2.784492 -3.275114 -1.713597
C  2.0429 -4.470181 -1.865174
C  -3.854762 -0.394321 1.32372
C  -4.10145 0.669253 0.27463
C  -3.231896 1.786193 0.168304
C  -5.203819 0.564116 -0.609313
C  -3.463256 2.777405 -0.809037
C  -5.443485 1.563429 -1.580611
C  -4.571902 2.672092 -1.682828
H  0.813935 -0.737321 2.972896
H  1.571739 -2.96226 2.718892
H  2.931666 -1.926132 2.214795
H  1.314862 4.201726 -2.282759
H  2.125081 4.699568 -0.782118
H  4.05209 3.367094 -1.353408
H  3.282693 2.943441 -2.897868
H  -0.399553 -1.985601 0.544485
H  0.644771 -4.624655 1.274782
H  3.332722 -1.637635 -0.404571
H  0.691883 -5.878437 -0.891442
H  3.385935 -2.890572 -2.544506
H  2.069309 -5.019345 -2.813037
H  -4.628124 -1.178223 1.301635
H  -3.772804 0.038243 2.337044
H  -2.37016 1.882369 0.837374
H  -5.875239 -0.301137 -0.539236
H  -2.774078 3.6255 -0.880345
H  -6.302074 1.474703 -2.255979
H  -4.754877 3.446086 -2.437248
