program: Gaussian 09
title: 000149500
version: EM64L-G09RevD.01
frameworkgroup: C1[X(C12H8ClNO2)]
method: RPBEPBE
basis: SDD
operation: Freq
keyword: #p
keyword: freq=noraman
keyword: PBEPBE/SDD
title: #p freq=noraman PBEPBE/SDD
converged: YES YES NO NO
title: Mulliken charges:
elementType: Cl O O N C C C C C C C C C C C C H H H H H H H H
charge: -0.040827 -0.287857 -0.229358 -0.006105 0.335366 0.343155 -0.357608 -0.315608 -0.342125 -0.362093 -0.275143 -0.269328 0.132031 -0.178937 -0.171889 -0.123696 0.268214 0.272946 0.274934 0.267500 0.265042 0.275458 0.262700 0.263226
chargesum: 0.00000
title: Mulliken charges with hydrogens summed into heavy atoms:
elementType: Cl O O N C C C C C C C C C C C C
charge: -0.040827 -0.287857 -0.229358 -0.006105 0.335366 0.343155 -0.089394 -0.042662 -0.067190 -0.094593 -0.010100 0.006130 0.132031 0.083762 0.091338 -0.123696
polarizability: 2.88019869e+02 -9.52481042e+00 1.37261892e+02 1.00076080e+01 -2.73944181e+00 8.50777987e+01
1716.lowfreq: -3.3707 0.0020 0.0034 0.0034 5.5865 6.0888 25.0529 41.0564 53.8970
frequency: 24.9642 41.0516 53.8954 101.4780 127.5399 175.8794 210.6840 228.8735 265.6962 313.2681 331.2804 378.5314 396.9015 413.7766 421.9837 465.4038 500.7102 509.7632 601.0603 608.4172 629.8054 655.5953 698.6494 721.5944 746.1910 802.9992 815.4772 830.1225 836.4534 852.8764 855.8327 944.3539 958.3170 977.9953 990.7475 992.0315 996.3710 1069.5221 1101.7386 1105.3573 1110.3821 1153.9719 1174.2585 1185.9283 1225.5074 1282.9095 1287.5901 1324.1406 1366.0231 1390.4154 1397.9915 1435.9604 1464.7788 1471.4289 1574.3788 1586.7243 1595.4159 1609.0689 3146.7569 3156.5852 3157.0465 3165.6171 3167.7515 3177.5818 3179.7082 3184.4575
redmass: 5.4157 7.6866 5.2058 8.2363 8.3481 9.3568 9.4177 10.1153 7.5769 5.9839 6.2846 6.2703 9.8558 2.9801 3.2210 4.2089 2.8829 4.1024 6.1385 7.3580 7.4309 7.0815 4.0675 4.4381 5.2155 6.3238 1.2846 1.5631 1.2580 2.7412 2.2517 1.3268 1.3539 1.3337 1.4539 2.2679 4.0063 2.6915 1.3408 1.3408 2.1257 2.2187 1.3248 1.6429 4.4756 1.2826 1.2924 8.1339 6.5974 6.6804 3.6950 4.5217 2.3555 2.4754 7.8198 6.8095 7.4170 6.5599 1.0878 1.0889 1.0894 1.0891 1.0960 1.0971 1.0972 1.0980
irintensity: 0.7372 0.7657 0.5333 1.9643 0.1290 0.2799 5.9826 1.3870 2.7778 0.9657 0.5620 4.9115 2.4739 0.1927 1.3082 20.8938 26.3554 16.4256 1.4229 8.6110 4.2217 20.5804 3.8859 2.9260 4.7301 26.5481 6.3138 76.7287 11.5720 65.7142 54.8166 0.5002 0.3540 0.7974 0.5854 6.2721 72.5139 87.6720 29.0722 16.1581 325.6110 23.2327 1.2409 4.6042 675.6073 8.5185 6.5203 174.5188 0.8986 2.2641 1.9647 12.3710 350.6684 31.2238 14.4444 24.4143 77.1009 134.7153 0.2428 1.3189 5.8802 2.1366 5.6273 1.2180 3.0452 0.7118
temp: 298.150 k
press: 1.00000 atm
elementType: 17 8 8 7 6 6 6 6 6 6 6 6 6 6 6 6 1 1 1 1 1 1 1 1
symmnumber: 1
zpe: 440976.8 jmol-1
zpe.correction: 0.167959 hartree
zpe.thermalcorrener: 0.181433 hartree
zpe.thermalcorrenthalpy: 0.182377 hartree
zpe.thermalcorrgfe: 0.125661 hartree
zpe.sumelectzpe: -1126.140848 hartree
zpe.sumelectthermal: -1126.127374 hartree
zpe.sumelectthermalent: -1126.126430 hartree
zpe.sumelectthermalfe: -1126.183147 hartree
dipole: -3.7860 2.0795 0.2323
dipole: 4.3258
quadrupole: -135.1726 -97.1698 -95.4695
quadrupole: 10.3554 4.8102 -3.1329
quadrupole: -25.9020 12.1008 13.8011 10.3554 4.8102 -3.1329
hfenergy: -1126.3088077 hartree
pointgroup: C01 [X(C12H8Cl1N1O2)]
dipole: 1.533097 -0.6838211 0.2800191 debye
dipolederiv: -0.7947379 -0.2629206 0.0651176 -0.369162 -0.2365899 0.0023593 0.1001855 0.0087539 -0.0812344 -2.6317431 0.0028188 -0.036346 0.1178215 -0.3863681 0.0484243 0.3023986 0.0597817 -0.2256925 -0.6131281 0.0607705 -0.0040473 1.1152707 -0.6224501 0.2271573 -0.6609672 0.2948985 -0.2976792 1.454043 -0.4324664 0.1526362 -1.2043498 0.3917268 -0.284359 0.5949417 -0.3246617 -0.0176896 2.119558 -0.1613889 0.0906933 -0.8064097 0.2903864 -0.1392088 0.0512372 -0.1317623 0.2192546 1.5780905 0.2120951 -0.0442522 0.7804018 0.1822151 0.042276 -0.4064283 0.0023732 0.0951375 -0.8439516 0.0088268 -0.0061109 -0.2029634 0.0303333 -0.1161049 0.1193045 -0.1200484 -0.1163261 -0.4309074 0.1335589 -0.1065588 0.5871448 -0.2555124 0.0387511 -0.2992645 0.0351525 -0.1680378 -0.2503768 0.0152508 -0.0479644 -0.1701937 -0.0825359 0.0483577 -0.0474492 0.0378846 -0.0916167 -0.2463387 -0.004949 -0.0352844 -0.0233951 0.0272273 0.0496624 0.0171471 0.0738547 -0.0943486 0.4874979 -0.0290187 -0.0166371 -0.3501334 0.1187257 -0.11435 0.1673206 -0.1261786 -0.0084302 0.455154 -0.1496249 0.0631701 0.0500194 0.0013991 -0.0446691 -0.0986712 -0.0165981 -0.0261631 -1.3614938 0.3663378 -0.1428666 0.2406352 -0.0905976 0.1061525 0.0336231 0.0773793 0.0294613 -0.2227052 -0.0766886 -0.0043477 -0.0499662 -0.0037283 0.0621021 0.0196121 0.0733808 -0.0520329 -0.2068075 -0.0898953 -0.037066 -0.1740383 -0.0797352 0.0535567 -0.0812112 0.0449236 -0.0488634 1.0548874 0.46535 -0.1269641 0.5795084 0.2511739 -0.0004558 -0.1371858 -0.0105816 -0.0334253 0.1047533 0.0467742 -0.0168573 0.0374273 0.0333008 0.087816 -0.0146134 0.0861687 0.1135034 0.0136238 -0.0388016 0.0551926 -0.0659196 0.0767935 0.0412423 0.1003745 0.0423833 0.1103122 0.0268314 0.0214341 0.0807568 0.0392382 0.0835839 -0.0360615 0.1254449 -0.0354534 0.1066889 0.122091 -0.0549721 0.0096966 -0.0539728 0.0151218 -0.0699697 0.0029433 -0.0654348 0.1252189 0.0178917 -0.0667924 0.0572427 -0.0241263 0.0873986 0.0510646 0.0383963 0.0498865 0.1224644 0.0819465 0.0298489 -0.0206945 -0.0281707 0.0571968 0.0721196 -0.0016396 0.0627655 0.1084559 0.0750818 -0.0300719 0.003455 -0.0444479 0.0173172 -0.0759815 0.0025967 -0.0687659 0.1201638 0.0107398 0.0345247 0.0680367 0.0197816 0.0936174 -0.0498814 0.0719041 -0.0501022 0.110879 unknown
polarizability: 288.8929224|-2.242319|134.909791|-6.4904747|-9.6201083|86.5568468 unknown
InChI: InChI=1S/C12H8ClNO2/c13-9-1-5-11(6-2-9)16-12-7-3-10(14-15)4-8-12/h1-8H
charge 0 multiplicity 1
24 atoms
Cl 5.652827 1.447584 -0.273089
O  0.388428 -1.414161 0.379949
O  -5.100461 1.577721 -0.897092
N  -4.894293 0.495324 -0.227767
C  -0.879252 -0.83648 0.208135
C  1.582234 -0.663291 0.185989
C  -1.951136 -1.555523 0.794255
C  -1.106015 0.345207 -0.553827
C  1.787064 0.586932 0.812655
C  2.602745 -1.286157 -0.56131
C  -3.261289 -1.082458 0.626749
C  -2.418143 0.809665 -0.716329
C  -3.500518 0.101681 -0.121654
C  3.033706 1.233572 0.668672
C  3.851628 -0.64227 -0.702354
C  4.046438 0.611474 -0.089398
H  -1.730462 -2.462428 1.363495
H  -0.266793 0.869132 -1.020798
H  0.998029 1.044827 1.416935
H  2.416517 -2.261419 -1.019382
H  -4.119302 -1.603631 1.064267
H  -2.639203 1.708673 -1.302391
H  3.213993 2.199859 1.147783
H  4.654356 -1.108734 -1.279795
