program: Gaussian 09
title: 000149486
version: EM64L-G09RevD.01
frameworkgroup: C1[X(C5H10N2OS)]
method: RPBEPBE
basis: SDD
operation: Freq
keyword: #p
keyword: freq=noraman
keyword: PBEPBE/SDD
title: #p freq=noraman PBEPBE/SDD
converged: YES YES NO NO
title: Mulliken charges:
elementType: S O N N C C C C C H H H H H H H H H H
charge: 0.193718 -0.277898 -0.075396 0.045244 -0.409064 -0.310682 -0.296079 -0.696055 -0.668508 0.296002 0.267993 0.263262 0.214590 0.231073 0.275619 0.277250 0.232550 0.212475 0.223906
chargesum: 0.00000
title: Mulliken charges with hydrogens summed into heavy atoms:
elementType: S O N N C C C C C
charge: 0.193718 -0.277898 -0.075396 0.045244 -0.113062 0.220574 0.149584 -0.143187 0.000424
polarizability: 1.05120152e+02 -4.31191477e+00 9.17821497e+01 4.90854936e+00 4.82402168e+00 6.63898042e+01
1716.lowfreq: -0.0020 0.0021 0.0025 6.7344 11.0614 17.7603 36.7402 101.3208 126.2174
frequency: 36.1594 101.1904 126.1790 170.7632 204.8589 222.4469 250.4394 350.4558 357.1796 406.1829 422.7835 497.0938 643.5089 653.7198 738.7760 781.2552 812.8029 849.4332 911.4765 997.2646 1014.4823 1043.4620 1066.4432 1087.9245 1114.5279 1138.0396 1174.3673 1194.8613 1219.0511 1257.6365 1265.8771 1291.5805 1314.0639 1331.5618 1348.8073 1390.2226 1454.6611 1464.3599 1468.2068 1474.6474 1486.6817 2981.9681 2984.0656 3004.5287 3036.4981 3045.6625 3061.7964 3063.8923 3080.5770 3088.2713 3127.2242
redmass: 4.7939 2.6146 3.2765 1.7611 1.7755 5.0877 1.9508 4.2940 6.0374 5.8329 4.7718 4.2223 4.1022 2.9612 6.4436 2.4590 1.3109 1.7184 2.0868 1.4135 2.3014 1.5686 2.1405 3.9034 2.3006 1.7605 1.3333 1.5771 2.0059 1.2466 1.4014 1.2533 2.4094 1.5462 1.8709 1.2075 1.0824 1.0774 1.0861 1.0439 1.0544 1.0375 1.0589 1.0590 1.0984 1.0665 1.0958 1.0889 1.0998 1.0997 1.1079
irintensity: 5.7611 0.7495 1.0204 1.1615 0.2993 5.1771 2.0284 0.4550 0.0323 8.6785 4.6595 2.0200 2.9349 3.5916 25.0991 4.2291 13.2587 14.0960 19.1582 4.2658 23.6957 1.0457 47.9224 120.3359 4.4775 5.9807 3.6715 38.8610 14.0750 24.4796 38.4119 9.7525 49.3610 17.6118 15.2750 20.1391 6.1593 9.3061 10.9096 12.3344 13.3021 35.3047 10.4410 8.6256 4.5764 16.0523 16.6592 3.9729 44.9758 28.1713 9.2320
temp: 298.150 k
press: 1.00000 atm
elementType: 16 8 7 7 6 6 6 6 6 1 1 1 1 1 1 1 1 1 1
symmnumber: 1
zpe: 398415.8 jmol-1
zpe.correction: 0.151749 hartree
zpe.thermalcorrener: 0.161569 hartree
zpe.thermalcorrenthalpy: 0.162514 hartree
zpe.thermalcorrgfe: 0.115928 hartree
zpe.sumelectzpe: -778.529027 hartree
zpe.sumelectthermal: -778.519206 hartree
zpe.sumelectthermalent: -778.518262 hartree
zpe.sumelectthermalfe: -778.564847 hartree
dipole: -2.8286 1.9354 1.8711
dipole: 3.9048
quadrupole: -73.5784 -60.9184 -60.1494
quadrupole: 10.4918 1.1380 2.1577
quadrupole: -8.6963 3.9637 4.7327 10.4918 1.1380 2.1577
hfenergy: -778.6807757 hartree
pointgroup: C01 [X(C5H10N2O1S1)]
dipole: 0.9976398 -0.8084335 0.8433989 debye
dipolederiv: -0.2486429 0.030797 -0.0230244 -0.0431259 -0.2633236 0.0067187 -0.0495358 -0.0132577 -0.1204953 -1.152722 0.569546 -0.219363 -0.1352113 -0.2325537 0.0259316 0.1333546 -0.0115156 -0.2053156 -0.7827103 0.1837668 -0.128432 0.5486012 -0.5836045 0.0631863 -0.4278651 0.1288857 -0.2396491 1.2032908 -0.7651149 0.3018095 -0.573055 0.318709 -0.2025161 0.2506598 -0.2001706 0.0003295 0.5718268 -0.0649618 0.0752477 0.0398374 0.5364989 0.1163781 0.0585996 0.1486895 0.2213799 0.0860287 0.0338655 0.022076 0.0996579 0.147005 0.0856638 0.1160898 0.0721114 0.194713 -0.0350674 0.0916053 0.0117366 0.0022394 -0.0428674 -0.0768382 0.0112791 -0.0801857 0.0326617 0.1888511 0.0360585 -0.0799861 0.0848056 0.0685971 -0.0350044 -0.0594223 -0.0506623 0.2031626 -0.0785751 -0.0039228 0.0085016 -0.0535016 0.057945 -0.0342974 -0.0543937 -0.0354403 0.0619336 0.0351502 0.0108205 0.0017552 -0.041121 -0.0066393 0.0570478 0.0300724 0.0174962 -0.0196079 0.0220086 -0.0482763 -0.0480962 -0.0034922 0.0149336 -0.0065254 -0.0896171 -0.0468183 -0.0059149 -0.0012912 0.0014973 0.0783798 0.0689593 0.0513125 -0.0412991 0.0429905 0.0134428 -0.0232307 0.0324656 -0.0530122 0.0460473 -0.0327582 0.0326263 0.1273165 0.048067 0.0725566 -0.0805136 -0.0006591 0.0481122 -0.0017077 0.069157 -0.1101893 -0.0455827 -0.0077028 -0.0524594 0.0743011 -0.0118707 -0.0021033 0.0003981 -0.0044072 0.0938934 -0.0511705 -0.0148542 0.0245232 -0.1410169 0.0616389 -0.064384 0.0176843 -0.0299272 -0.0739196 0.0101478 0.0092772 -0.002449 0.0920477 0.0711039 0.0629936 0.0143208 0.1285112 -0.0737876 -0.0132072 0.0412233 -0.0068178 0.0871141 0.0578166 0.0037052 0.0012898 -0.025967 0.0322734 0.1016512 0.0682834 0.1258302 -0.0969614 -0.0186425 -0.0709925 -0.0786371 -0.0992025 0.0330907 -0.0876011 -0.1065059 -0.1037592 -0.0349379 unknown
polarizability: 105.1922639|-4.6637656|92.1240704|-1.6407285|-5.4674589|65.9757719 unknown
InChI: InChI=1S/C5H10N2OS/c1-2-5-7(6-8)3-4-9-5/h5H,2-4H2,1H3
charge 0 multiplicity 1
19 atoms
S  1.168699 -1.644236 -0.830207
O  -2.817591 0.993693 -0.682416
N  -0.779292 0.13012 -0.40686
N  -1.551631 1.168331 -0.874788
C  0.678866 0.192581 -0.658937
C  -1.359784 -1.126301 0.139571
C  1.450223 0.921806 0.457435
C  -0.183285 -2.071384 0.437652
C  2.951895 1.062391 0.141016
H  0.851942 0.673121 -1.636617
H  -2.05069 -1.540744 -0.618572
H  -1.957704 -0.903615 1.041658
H  1.306877 0.38643 1.41566
H  0.98948 1.923389 0.57421
H  0.219314 -1.928614 1.452631
H  -0.455568 -3.127179 0.292267
H  3.423833 0.070033 0.025131
H  3.111758 1.631077 -0.794258
H  3.472658 1.598203 0.954023
