program: Gaussian 09
title: 000149483
version: EM64L-G09RevD.01
frameworkgroup: C1[X(C10H11N3O3)]
method: RPBEPBE
basis: SDD
operation: Freq
keyword: #p
keyword: freq=noraman
keyword: PBEPBE/SDD
title: #p freq=noraman PBEPBE/SDD
converged: NO YES NO NO
title: Mulliken charges:
elementType: O O O N N N C C C C C C C C C C H H H H H H H H H H H
charge: -0.225501 -0.250676 -0.231458 -0.471659 -0.168113 0.035874 0.493274 0.318150 -0.457884 -0.348004 -0.322035 -0.352401 0.119916 0.323781 -0.790433 -0.622306 0.232305 0.301928 0.245224 0.280719 0.352699 0.236979 0.236972 0.262917 0.260461 0.260407 0.278864
chargesum: 0.00000
title: Mulliken charges with hydrogens summed into heavy atoms:
elementType: O O O N N N C C C C C C C C C C
charge: -0.225501 -0.250676 -0.231458 -0.118960 -0.168113 0.035874 0.493274 0.318150 -0.225580 -0.046076 -0.076810 -0.071682 0.119916 0.323781 -0.053564 0.177426
polarizability: 2.67741256e+02 -7.03520886e+00 1.47166887e+02 2.14144720e-02 -1.24795728e-02 6.48167819e+01
1716.lowfreq: -12.6306 -0.0012 -0.0010 -0.0007 3.3378 4.4486 34.7677 45.9920 74.5051
frequency: 34.7255 45.9576 74.4838 81.9278 96.1910 123.3673 131.4777 149.0458 169.8809 206.9188 209.4827 298.6454 305.1210 312.2943 363.9608 391.3633 400.0744 410.3131 474.0170 489.7644 501.9570 572.3295 594.4406 629.8145 692.3917 699.6658 744.3817 760.5184 790.7125 826.4681 841.6397 852.0754 880.0534 922.0697 947.3845 958.9298 1004.7560 1010.5284 1029.2931 1072.1639 1092.4954 1117.3365 1129.2786 1185.0529 1192.9655 1256.4048 1275.2965 1289.0546 1311.4268 1368.6611 1371.9686 1380.3576 1417.8735 1425.4402 1448.8772 1462.5903 1465.0095 1470.3204 1502.6479 1525.5354 1571.9609 1601.7859 1624.0320 1661.1332 2986.2856 3009.3805 3070.2363 3094.9819 3123.2899 3128.5151 3153.2958 3156.0168 3160.5462 3196.4558 3425.8167
redmass: 8.2176 3.8052 4.0186 6.6855 4.1099 1.2893 3.7674 1.0337 8.7691 6.7259 4.6252 6.4173 5.4390 3.5389 6.2717 6.1311 4.2492 2.9398 6.1157 8.0346 3.1432 4.6816 2.3131 7.1564 6.9495 5.1435 3.4074 5.5099 1.2317 5.8168 1.3627 6.4300 1.3976 3.0411 2.2059 1.3780 3.1196 1.3831 1.7379 2.7793 3.4755 1.3276 1.3317 2.5237 1.1365 2.2815 3.2920 4.9668 1.3614 2.7771 2.2407 3.3421 1.2243 4.0957 1.0977 1.0424 1.0494 1.0742 2.2202 2.7510 5.0127 5.5946 6.3983 8.5905 1.0379 1.0338 1.0970 1.1011 1.0896 1.0987 1.1009 1.0907 1.0946 1.0949 1.0764
irintensity: 2.5558 1.4023 0.8292 1.8570 9.6177 2.6338 1.6346 0.4906 1.4022 0.0962 12.5058 16.5477 0.0791 11.8015 18.1692 1.7910 0.2165 0.0251 5.8744 2.7184 12.9532 11.4287 18.8928 0.8334 1.7855 33.6733 0.2659 52.4449 20.5212 12.2372 93.9582 68.1366 58.2981 334.1524 20.4174 1.2617 0.7522 0.0739 1.5644 18.1713 117.2839 0.4746 9.4050 18.2629 68.6043 15.8251 303.5286 49.0031 4.4415 177.2514 114.0790 128.7995 52.1854 72.5447 26.2967 23.1428 21.1468 18.1650 49.9732 488.2024 393.7163 53.8819 114.9714 193.6058 3.7628 13.0212 13.1522 11.1424 15.5976 14.8014 0.4208 3.8822 7.6096 1.3423 90.5923
temp: 298.150 k
press: 1.00000 atm
elementType: 8 8 8 7 7 7 6 6 6 6 6 6 6 6 6 6 1 1 1 1 1 1 1 1 1 1 1
symmnumber: 1
zpe: 530860.3 jmol-1
zpe.correction: 0.202194 hartree
zpe.thermalcorrener: 0.217711 hartree
zpe.thermalcorrenthalpy: 0.218655 hartree
zpe.thermalcorrgfe: 0.158279 hartree
zpe.sumelectzpe: -776.385302 hartree
zpe.sumelectthermal: -776.369785 hartree
zpe.sumelectthermalent: -776.368840 hartree
zpe.sumelectthermalfe: -776.429217 hartree
dipole: -1.8645 2.7015 0.0028
dipole: 3.2824
quadrupole: -102.2716 -96.4442 -93.6612
quadrupole: 24.0530 -0.0146 0.0042
quadrupole: -4.8125 1.0148 3.7978 24.0530 -0.0146 0.0042
hfenergy: -776.5874957 hartree
pointgroup: C01 [X(C10H11N3O3)]
dipole: 0.7521543 1.0497517 -0.0010907 debye
polarizability: 267.9516604|4.907191|146.956483|0.021631|0.0121004|64.8167819 unknown
InChI: InChI=1S/C10H11N3O3/c1-7(14)8-3-5-9(6-4-8)11-10(15)13(2)12-16/h3-6,11H,1-2H3
charge 0 multiplicity 1
27 atoms
O  -4.959029 -1.180911 -0.000108
O  2.104076 -1.96127 -0.000257
O  5.032205 1.58406 0.002119
N  1.358577 0.287822 -0.00051
N  3.66736 -0.201601 -0.000484
N  3.819194 1.185407 -0.000599
C  -0.052834 0.154667 -0.000383
C  -2.896605 0.06052 -0.000193
C  -0.811956 1.357249 -0.000438
C  -0.719664 -1.102237 -0.00024
C  -2.215823 1.307861 -0.000341
C  -2.123626 -1.132277 -0.000147
C  -4.393363 -0.047323 -0.000101
C  2.303087 -0.719153 -0.000461
C  -5.224929 1.232274 -0.00025
C  4.822697 -1.113566 -0.00038
H  -0.296788 2.325587 -0.000563
H  -0.136702 -2.02471 -0.000204
H  -2.778541 2.24659 -0.000401
H  -2.660216 -2.0868 -0.000043
H  1.752903 1.238534 -0.00066
H  -5.007982 1.848925 -0.892405
H  -5.007926 1.849193 0.891703
H  -6.292213 0.966056 -0.000182
H  5.443626 -0.932059 0.893419
H  5.44363 -0.932237 -0.89421
H  4.435041 -2.141202 -0.000281
