program: Gaussian 09
title: 000149537
version: EM64L-G09RevD.01
frameworkgroup: C1[X(C23H19Cl2N3O3)]
method: RPBEPBE
basis: SDD
operation: Freq
keyword: #p
keyword: freq=noraman
keyword: PBEPBE/SDD
title: #p freq=noraman PBEPBE/SDD
converged: YES YES NO NO
title: Mulliken charges:
elementType: Cl Cl O O O N N N C C C C C C C C C C C C C C C C C C C C C C C H H H H H H H H H H H H H H H H H H H
charge: -0.034482 -0.045624 -0.230284 -0.282898 -0.247938 -0.201125 -0.003851 0.001028 -0.374707 -0.390497 0.220538 -0.103667 -0.513013 0.136191 0.038507 0.324334 0.355527 0.284503 -0.365788 -0.385117 -0.374888 -0.366853 -0.200929 -0.206904 -0.219823 -0.200701 -0.214222 -0.124005 -0.136520 -0.233447 -0.678283 0.252573 0.270080 0.252247 0.238488 0.248977 0.255651 0.261512 0.268721 0.278423 0.259967 0.262641 0.264500 0.249475 0.261532 0.239729 0.231844 0.218657 0.235063 0.224857
chargesum: 0.00000
title: Mulliken charges with hydrogens summed into heavy atoms:
elementType: Cl Cl O O O N N N C C C C C C C C C C C C C C C C C C C C C C C
charge: -0.034482 -0.045624 -0.230284 -0.282898 -0.247938 -0.201125 -0.003851 0.001028 0.147946 0.100239 0.220538 -0.103667 -0.008384 0.136191 0.038507 0.324334 0.355527 0.284503 -0.104276 -0.116396 -0.096465 -0.106886 0.061712 0.057596 -0.219823 0.048774 0.047310 -0.124005 -0.136520 0.238126 0.000293
polarizability: 3.79510735e+02 1.65194079e+01 3.92073232e+02 7.07882560e+00 1.59752015e+01 1.80951153e+02
1716.lowfreq: -6.5868 -3.4654 -0.0013 -0.0005 0.0014 4.5867 10.9210 22.2799 25.9042
frequency: 10.6155 22.2748 25.8236 28.6021 42.3315 45.9836 54.7437 56.1160 64.2548 68.5326 74.6133 89.9653 102.7906 126.3189 131.3093 145.2341 158.6514 170.4234 188.1362 196.1932 229.6081 236.4512 249.8125 254.0458 273.3003 297.2128 316.6407 331.7330 338.1984 346.5719 369.3693 389.6920 405.2273 411.6244 417.4463 429.9706 439.4863 441.8033 452.6053 468.3793 488.3133 508.4218 539.4788 552.8077 595.0964 604.7723 620.4944 629.0157 644.9626 661.3549 684.5090 690.9318 717.3246 722.2571 727.4883 773.9060 787.9865 797.1155 809.4242 821.3521 829.7575 832.4538 835.8063 838.8701 855.0474 894.0248 913.0823 933.7824 956.1920 958.5326 970.4524 973.2268 993.5835 999.9526 1004.6771 1012.4948 1022.1298 1073.1377 1075.7205 1084.0509 1092.0582 1112.0997 1113.6584 1115.4422 1126.2156 1135.0163 1143.9176 1174.8993 1192.2362 1193.4213 1194.6512 1241.3505 1247.6533 1253.9748 1296.7033 1300.2790 1301.7948 1320.3233 1333.7357 1348.0893 1349.2787 1358.6112 1362.3178 1366.5284 1376.9407 1392.0295 1395.6739 1400.8336 1429.2589 1443.0538 1453.3607 1456.6017 1463.1488 1473.7545 1475.3908 1484.9789 1487.4739 1518.8422 1573.8360 1577.8270 1595.8259 1598.5108 1608.0254 1639.5775 2177.5628 2996.1287 2998.4114 3013.1232 3016.7089 3050.3295 3062.4467 3071.1137 3080.4636 3092.8505 3106.1645 3124.8791 3145.3156 3149.6088 3151.0019 3153.9881 3169.0054 3175.0380 3176.6526 3178.3380
redmass: 6.2515 5.1919 8.5989 11.7207 7.0080 5.6589 5.6528 4.7740 2.8315 7.8619 4.6941 6.7910 4.4772 8.0749 7.0663 3.9002 3.1450 6.6490 6.3199 6.4630 5.2960 4.4285 3.6827 1.7713 4.9841 4.4532 4.7487 4.9732 3.8501 6.4828 3.1790 3.9458 3.2159 2.9965 6.3039 6.5098 11.2635 4.6707 6.7358 6.8121 4.4220 3.3088 3.5555 3.1645 7.5685 5.1007 7.1995 7.2721 5.1953 4.1896 6.6724 6.7613 5.5636 5.7154 3.9478 5.9518 2.5772 1.2078 3.2057 2.6092 1.3683 1.2719 1.6402 1.6273 3.5426 3.8141 6.1253 4.0963 1.3245 1.3455 1.3699 1.3621 3.6697 3.7143 2.9659 2.4996 2.3977 3.6083 2.7826 2.0107 3.4894 2.1772 1.4875 1.4185 2.4150 1.5067 2.8745 1.9809 1.2516 1.5659 1.2674 6.5403 1.1470 1.4970 1.4713 1.3893 1.7252 2.0141 1.4466 2.7665 1.6332 3.4952 1.5922 1.8880 3.3313 4.0171 3.4471 1.2902 3.5110 1.0871 1.2737 1.1124 1.0409 1.0887 2.3828 1.9992 1.2408 9.1440 7.5421 7.5863 6.3739 6.1820 10.2748 9.4957 12.6357 1.0359 1.0640 1.0585 1.0617 1.0610 1.0953 1.1058 1.1004 1.0989 1.1025 1.1061 1.0901 1.0896 1.0895 1.0889 1.0958 1.0961 1.0973 1.0972
irintensity: 0.2094 0.1068 0.9343 0.0816 1.5209 0.5693 0.2051 1.3374 0.0873 0.8930 1.1281 0.8276 1.1899 0.4204 1.0949 2.8437 5.3686 4.2227 0.0547 3.1440 0.8891 2.5006 0.6437 5.4549 5.0142 7.7296 5.0043 1.7910 2.2223 1.1218 4.9026 5.2063 1.2453 0.8303 3.8894 4.1537 9.7468 20.6271 10.7187 3.3441 11.5594 3.2139 19.5743 1.6338 18.1079 0.8346 0.2388 3.9824 8.2480 4.5510 1.7314 8.1291 2.5483 3.5893 7.1979 10.9982 26.7974 2.7255 25.8940 15.6697 25.8551 1.8131 42.3925 16.2071 20.4374 3.0952 51.0110 33.8882 0.0094 2.5187 0.4021 1.5827 94.2310 43.1464 2.8431 4.1221 48.4971 33.9447 52.1904 51.3931 92.3633 1.6716 8.8808 10.0096 35.5346 10.8580 162.7103 31.9035 7.5021 26.9705 12.4236 2.2985 0.2716 1.6453 11.1120 3.7669 9.2242 36.7900 21.7574 8.6575 7.9976 17.3804 1.9205 39.8512 13.4047 24.5721 11.3344 16.7560 44.3021 21.1467 54.8307 16.1835 10.8628 6.1008 58.7401 46.7725 22.0558 8.3221 1.7214 2.9422 160.2811 10.4583 321.0048 152.8094 3.2066 15.9119 9.7130 15.3720 18.5984 6.9619 8.7801 3.8684 23.4252 37.7763 56.1570 0.7150 2.5438 2.1219 3.6635 4.4290 3.3423 2.2491 2.5077 0.1064
temp: 298.150 k
press: 1.00000 atm
elementType: 17 17 8 8 8 7 7 7 6 6 6 6 6 6 6 6 6 6 6 6 6 6 6 6 6 6 6 6 6 6 6 1 1 1 1 1 1 1 1 1 1 1 1 1 1 1 1 1 1 1
symmnumber: 1
zpe: 968642.7 jmol-1
zpe.correction: 0.368937 hartree
zpe.thermalcorrener: 0.398299 hartree
zpe.thermalcorrenthalpy: 0.399243 hartree
zpe.thermalcorrgfe: 0.304246 hartree
zpe.sumelectzpe: -2195.686180 hartree
zpe.sumelectthermal: -2195.656817 hartree
zpe.sumelectthermalent: -2195.655873 hartree
zpe.sumelectthermalfe: -2195.750870 hartree
dipole: -2.4155 4.6979 1.0755
dipole: 5.3909
quadrupole: -195.4536 -230.5026 -187.4737
quadrupole: 3.0978 -17.5334 3.6854
quadrupole: 9.0231 -26.0260 17.0029 3.0978 -17.5334 3.6854
hfenergy: -2196.0551165 hartree
pointgroup: C01 [X(C23H19Cl2N3O3)]
dipole: -0.8838861 1.881275 0.4218272 debye
polarizability: 380.7690251|17.2388129|391.3511941|3.1487984|13.1343991|180.4149 unknown
InChI: InChI=1S/C23H19Cl2N3O3/c1-2-31-20(29)4-3-13-28-23(30)19(14-26)21(15-5-9-17(24)10-6-15)22(27-28)16-7-11-18(25)12-8-16/h5-12H,2-4,13H2,1H3
charge 0 multiplicity 1
50 atoms
Cl 6.778346 0.75098 1.047774
Cl 0.476075 5.89552 -1.045252
O  -0.897151 -4.227414 -0.657559
O  -4.088795 1.050988 1.318888
O  -5.293499 -0.229859 -0.209536
N  -1.508917 -1.965553 -0.787791
N  -1.242024 -0.629181 -0.792695
N  2.618104 -4.38795 0.018884
C  -2.938692 -2.335074 -0.953678
C  -3.649692 -2.561236 0.400969
C  1.128188 -1.137889 -0.39289
C  0.031275 -0.206648 -0.615324
C  -3.674178 -1.318717 1.314677
C  -0.543439 -3.013863 -0.633203
C  0.82693 -2.512313 -0.422873
C  2.505423 -0.664384 -0.065213
C  0.18308 1.276813 -0.69878
C  -4.440066 -0.154075 0.704416
C  2.709114 0.253021 1.001415
C  3.634086 -1.145175 -0.779839
C  -0.804548 2.110074 -0.108199
C  1.251063 1.881514 -1.413383
C  4.005937 0.67929 1.350923
C  4.936666 -0.71397 -0.45198
C  1.815177 -3.52396 -0.178119
C  -0.720462 3.514423 -0.209128
C  1.344246 3.284548 -1.526279
C  5.103515 0.192664 0.612481
C  0.357484 4.082525 -0.915687
C  -4.829623 2.268226 0.851951
C  -4.431103 3.411458 1.77923
H  -2.966905 -3.26736 -1.540275
H  -3.417815 -1.519164 -1.515674
H  -3.168035 -3.40272 0.93051
H  -4.686949 -2.86505 0.169411
H  -2.659087 -0.975688 1.580198
H  -4.168819 -1.575867 2.272379
H  1.853427 0.629618 1.570466
H  3.502624 -1.851078 -1.606243
H  -1.643765 1.655135 0.428939
H  2.010672 1.263052 -1.900279
H  4.159264 1.375843 2.179718
H  5.801478 -1.082725 -1.010115
H  -1.476762 4.155226 0.25352
H  2.165029 3.745238 -2.082865
H  -5.911941 2.050754 0.886997
H  -4.549856 2.45393 -0.20086
H  -4.937692 4.341923 1.464808
H  -4.72008 3.193981 2.821418
H  -3.341109 3.58487 1.753947
