program: Gaussian 09
title: 000149489
version: EM64L-G09RevD.01
frameworkgroup: C1[X(C10H8ClN3O)]
method: RPBEPBE
basis: SDD
operation: Freq
keyword: #p
keyword: freq=noraman
keyword: PBEPBE/SDD
title: #p freq=noraman PBEPBE/SDD
converged: YES YES NO NO
title: Mulliken charges:
elementType: Cl O N N N C C C C C C C C C C H H H H H H H H
charge: -0.001008 -0.213355 -0.463553 -0.030776 -0.626133 0.437362 0.317695 -0.411294 -0.366305 -0.421380 0.140686 0.079264 -0.220470 -0.222603 -0.230024 0.326625 0.271477 0.252171 0.236779 0.233943 0.237535 0.313891 0.359472
chargesum: 0.00000
title: Mulliken charges with hydrogens summed into heavy atoms:
elementType: Cl O N N N C C C C C C C C C C
charge: -0.001008 -0.213355 -0.136928 -0.030776 0.047230 0.437362 0.317695 -0.411294 -0.094828 -0.169209 0.140686 0.079264 0.016309 0.011341 0.007510
polarizability: 1.98440935e+02 -6.27157070e+00 1.60456701e+02 -1.43867593e+00 -1.11477872e+01 7.39462238e+01
1716.lowfreq: -10.8370 -7.2762 -0.0009 0.0023 0.0024 6.7004 45.8989 53.7999 77.7583
frequency: 45.8676 53.7878 77.7575 102.1090 176.5258 204.7462 238.8351 247.0059 270.4529 294.7464 323.0853 331.7496 391.3671 402.8943 478.4352 526.5001 539.8432 574.1888 608.2729 612.2461 626.2219 638.9776 666.8433 692.9841 703.6985 748.8464 775.1506 847.4073 857.8406 929.8306 968.2585 981.2393 982.0116 989.1078 1003.0552 1028.8438 1062.0503 1085.7086 1148.5449 1176.8948 1193.9843 1201.8011 1300.6148 1319.9233 1366.4686 1379.4740 1433.9288 1447.1199 1482.9313 1578.1249 1581.7668 1594.3308 1609.8528 1614.6175 1640.3752 3122.0955 3136.4860 3149.1323 3163.2590 3175.8977 3526.7750 3554.1151 3705.3087
redmass: 4.5860 8.4723 5.6527 5.1178 8.8610 9.6152 3.8682 1.2254 5.0868 9.2047 9.4764 4.4409 6.5370 2.8344 4.3323 1.1532 8.4595 1.2192 5.8306 4.3554 7.5713 6.4353 7.0957 9.3651 1.8370 8.2888 1.9577 4.9233 1.3631 1.4169 7.5382 2.1396 1.5555 4.5880 1.3455 2.1962 5.2923 1.6011 2.9648 1.0534 1.1178 5.2828 2.0160 1.3737 2.9524 7.8729 2.3639 5.1498 2.3727 5.3848 5.3649 1.7336 6.8470 6.1724 2.6288 1.0875 1.0874 1.0927 1.0968 1.0997 1.0777 1.0457 1.1052
irintensity: 3.9106 2.8589 1.5937 1.1601 1.8826 0.2165 3.0723 67.0890 6.0515 0.7010 0.1176 3.5962 1.5944 0.3601 5.7271 301.8292 13.6966 49.4964 0.8891 2.6251 18.9283 3.0423 16.2925 6.5576 42.0440 32.3481 38.7754 15.0765 0.7232 1.2109 59.5200 10.3287 1.2540 0.6944 0.2318 10.6109 35.6352 8.4840 4.1355 0.0119 0.8447 24.8912 37.2550 9.6761 32.7319 3.1157 9.2283 166.7244 39.6151 444.6240 42.8617 27.7758 142.1329 96.8309 429.0213 6.1146 0.7986 19.3797 22.5850 8.6892 29.1939 106.6997 44.8365
temp: 298.150 k
press: 1.00000 atm
elementType: 17 8 7 7 7 6 6 6 6 6 6 6 6 6 6 1 1 1 1 1 1 1 1
symmnumber: 1
zpe: 434796.6 jmol-1
zpe.correction: 0.165605 hartree
zpe.thermalcorrener: 0.178600 hartree
zpe.thermalcorrenthalpy: 0.179544 hartree
zpe.thermalcorrgfe: 0.125279 hartree
zpe.sumelectzpe: -1084.356136 hartree
zpe.sumelectthermal: -1084.343142 hartree
zpe.sumelectthermalent: -1084.342197 hartree
zpe.sumelectthermalfe: -1084.396462 hartree
dipole: -6.2286 8.3296 0.8603
dipole: 10.4364
quadrupole: -100.5958 -80.0575 -93.4156
quadrupole: 18.0571 0.4852 -3.6494
quadrupole: -9.2395 11.2988 -2.0593 18.0571 0.4852 -3.6494
hfenergy: -1084.5217413 hartree
pointgroup: C01 [X(C10H8Cl1N3O1)]
dipole: -2.429421 3.1763822 -0.9315021 debye
dipolederiv: -0.1885709 -0.3023566 0.0551783 -0.1769142 -0.5950035 0.1207499 0.0498012 0.1087717 -0.0528325 -0.8791749 0.3749927 -0.1382906 0.4049603 -0.8466842 0.165758 -0.11637 0.1585998 -0.4152807 -1.0468114 -0.4210113 0.0703368 0.0524117 -0.7355811 0.1718926 -0.1213997 0.1889982 -0.2802629 -0.5768687 0.0525617 -0.0203872 -0.0713695 -1.3910498 0.3089881 0.0005961 0.3587448 -0.4118462 -0.4893299 -0.446076 0.1605816 -0.5667183 -1.362848 0.1220476 0.1805119 0.0868396 -0.7439433 0.5618884 0.0921557 0.0097842 -0.0569924 0.5727945 -0.1120409 0.1161193 -0.1710643 0.0868649 0.0796847 -0.1127549 0.0297225 -0.0050353 -0.0370649 -0.018054 -0.0721767 0.0201525 0.0148236 -0.6250653 0.58574 -0.1522198 0.2413912 0.6360193 -0.122894 -0.0816744 -0.13436 -0.072369 -0.0996919 -0.0123067 0.0755297 0.0061183 -0.0601713 -0.0779823 -0.003691 -0.0373423 -0.0101601 -0.0587386 0.0247303 -0.0826594 -0.0943419 -0.1518729 -0.0397809 -0.0033287 -0.0634747 -0.0020652 1.2675272 0.2659508 -0.0715823 0.4159356 1.8305743 -0.4362097 -0.1056357 -0.4686346 0.3773093 1.4375254 -0.2587282 0.1350192 -0.3364418 1.2159145 -0.3354673 0.1089307 -0.319718 0.3536776 -0.0036842 0.0518633 -0.1200356 0.0440484 -0.0822594 -0.0958762 -0.1096948 -0.0847785 0.0289244 -0.0841077 -0.029803 0.080453 -0.0494349 -0.0965387 -0.0900296 0.1232769 -0.1071147 0.0432243 0.0831866 0.002257 0.0047267 0.0105816 -0.1259248 -0.0440259 -0.0248878 -0.0333426 -0.0685858 0.2001649 0.0243844 -0.0045803 0.0600313 0.1606083 0.0289249 0.0552054 0.0358325 0.292048 0.0786047 0.0258747 -0.0643046 0.0220693 0.0997736 0.0683448 -0.0619245 0.0484238 0.0356263 0.0356402 -0.0448102 0.0944774 -0.0236144 0.1129269 0.0670605 0.1055808 0.0591281 0.0094339 0.0072238 -0.0282044 0.0712214 -0.0458799 0.1138265 0.0831574 0.0916366 0.0759725 -0.001095 0.0264237 0.0382894 -0.0642992 0.050349 0.1075391 0.0940807 -0.083831 0.0956877 -0.0223384 -0.1224545 0.0129566 -0.0085473 0.0136235 0.1440965 0.0312518 -0.0075565 0.0268452 0.1083142 0.1381271 0.0224887 -0.0309714 0.0494407 0.2537699 0.0525938 -0.0279712 0.0918151 0.358028 0.2585011 0.0818061 -0.0291531 0.055782 0.2371551 0.0575106 -0.0115169 0.0640182 0.3725045 unknown
polarizability: 198.3259704|-5.3147595|141.6929024|3.7806179|-37.5028387|92.8249867 unknown
InChI: InChI=1S/C10H8ClN3O/c11-7-8(6-4-2-1-3-5-6)13-10(12)14-9(7)15/h1-5,13H,12H2
charge 0 multiplicity 1
23 atoms
Cl 0.374462 -2.646002 0.791504
O  3.300417 -1.826694 0.803097
N  0.835823 1.280194 -0.193722
N  3.046136 0.3921 0.088261
N  2.756115 2.618887 -0.562204
C  0.2152 0.052411 0.130605
C  -1.271686 0.072272 0.070609
C  1.048179 -1.004287 0.44375
C  -2.060576 -0.467586 1.120123
C  -1.921315 0.682326 -1.038221
C  2.228661 1.390429 -0.214562
C  2.537922 -0.8782 0.473853
C  -3.468104 -0.397951 1.05953
C  -3.330348 0.746442 -1.097246
C  -4.108417 0.208216 -0.046898
H  0.232624 2.096666 -0.313721
H  -1.570637 -0.932513 1.980178
H  -1.326913 1.063631 -1.877511
H  -4.065462 -0.81591 1.876733
H  -3.818216 1.202608 -1.965347
H  -5.201809 0.255633 -0.091859
H  2.197765 3.399957 -0.894888
H  3.77098 2.690271 -0.551663
