program: Gaussian 09
title: 000149473
version: EM64L-G09RevD.01
frameworkgroup: C1[X(C8H9FN2O4)]
method: RPBEPBE
basis: SDD
operation: Freq
keyword: #p
keyword: freq=noraman
keyword: PBEPBE/SDD
title: #p freq=noraman PBEPBE/SDD
converged: YES YES NO NO
title: Mulliken charges:
elementType: F O O O O N N C C C C C C C C H H H H H H H H H
charge: -0.163202 -0.247780 -0.432343 -0.254340 -0.215759 -0.164314 -0.412687 -0.041228 -0.479974 -0.128147 -0.318087 0.234534 -0.156546 0.173156 0.115372 0.276525 0.271002 0.258522 0.238931 0.210036 0.228573 0.287332 0.350600 0.369826
chargesum: 0.00000
title: Mulliken charges with hydrogens summed into heavy atoms:
elementType: F O O O O N N C C C C C C C C
charge: -0.163202 -0.247780 -0.081743 -0.254340 -0.215759 -0.164314 -0.042862 0.235297 0.049550 0.110784 0.120522 0.234534 0.130786 0.173156 0.115372
polarizability: 1.60308731e+02 4.37598815e+00 1.11656155e+02 6.93761448e+00 -1.40360821e+00 6.78785636e+01
1716.lowfreq: -9.6964 -0.0003 0.0004 0.0006 0.4781 5.6870 13.6647 44.6537 67.6455
frequency: 13.4888 44.6380 67.6093 107.5321 148.2662 173.2751 177.8610 249.1406 274.8150 281.5858 287.4475 341.6003 371.4598 377.8910 442.8700 456.9359 476.1995 535.1778 544.7859 600.3368 658.4767 686.7190 703.8875 712.2785 748.5388 773.4112 835.6061 854.2795 864.6487 886.8211 920.7946 966.9486 999.0843 1032.5093 1061.4396 1087.6212 1107.6314 1131.0559 1150.1113 1178.2646 1198.1715 1245.7896 1253.1019 1274.6651 1290.0184 1312.6455 1315.5005 1318.7927 1366.1407 1371.6944 1395.8094 1433.6586 1464.2762 1489.7505 1630.2241 1646.5718 1671.6893 2978.3774 2990.2534 3026.1012 3071.4420 3085.7049 3113.4266 3196.4105 3522.6986 3575.6017
redmass: 6.3741 6.1985 3.9778 6.4194 4.2926 7.7855 5.9994 6.6137 1.1460 6.0373 13.2130 4.8428 3.5087 11.4798 2.9074 9.1032 4.0258 3.8348 6.7007 5.5717 4.4009 2.1204 7.0477 9.6005 8.6127 2.1255 3.0598 2.0393 2.2913 2.9391 1.5335 4.4417 3.4604 2.6212 2.7684 2.9995 2.3977 5.6749 1.4550 1.2234 5.3434 1.3904 1.7770 1.4267 1.2366 1.5189 1.4313 1.9244 1.7152 2.2111 1.4676 2.2328 1.0911 1.0868 6.0964 12.6847 6.5909 1.0702 1.0808 1.0637 1.0872 1.1016 1.1019 1.0932 1.0770 1.0667
irintensity: 1.4481 0.3307 0.7684 1.2240 10.4452 6.3094 5.6319 15.8137 152.8704 3.7661 1.2774 10.0224 7.4953 9.7717 3.3615 2.8380 18.2718 2.3983 23.3022 1.8713 7.7476 7.3835 25.7758 3.4203 14.5347 121.8759 23.3761 14.9390 30.9592 3.8594 8.1780 134.3490 120.6230 53.9136 5.5539 1.0937 59.9950 69.7917 16.5984 26.5411 21.3605 10.8565 161.2062 114.0120 9.4740 67.1297 8.7342 47.9823 26.5044 2.2847 3.1693 49.5443 13.7545 5.8918 291.4638 230.6837 499.9983 28.1676 56.0717 8.5466 0.9370 35.0901 11.8551 4.4617 67.3512 9.8863
temp: 298.150 k
press: 1.00000 atm
elementType: 9 8 8 8 8 7 7 6 6 6 6 6 6 6 6 1 1 1 1 1 1 1 1 1
symmnumber: 1
zpe: 457999.6 jmol-1
zpe.correction: 0.174443 hartree
zpe.thermalcorrener: 0.187934 hartree
zpe.thermalcorrenthalpy: 0.188878 hartree
zpe.thermalcorrgfe: 0.132390 hartree
zpe.sumelectzpe: -819.361322 hartree
zpe.sumelectthermal: -819.347830 hartree
zpe.sumelectthermalent: -819.346886 hartree
zpe.sumelectthermalfe: -819.403375 hartree
dipole: 7.1529 0.1650 0.0957
dipole: 7.1554
quadrupole: -83.1249 -95.3796 -91.0361
quadrupole: -9.1616 2.2248 -3.1859
quadrupole: 6.7220 -5.5327 -1.1892 -9.1616 2.2248 -3.1859
hfenergy: -819.5357644 hartree
pointgroup: C01 [X(C8H9F1N2O4)]
dipole: 2.8145631 0.0000573 -0.0579943 debye
dipolederiv: -0.2627758 0.1526253 0.0320353 0.4072561 -0.8685664 -0.1196279 0.0662504 -0.0884002 -0.1284677 -0.9166138 -0.22255 0.0072139 -0.3610717 -0.5389458 0.10354 0.192442 0.085649 -0.4494299 -0.5574216 -0.0480917 -0.3156541 -0.1238186 -0.5621356 -0.0640278 -0.494066 -0.0422651 -0.5092563 -0.5884406 0.1629427 0.0406526 0.1648474 -1.2745449 -0.1460567 0.0459637 -0.1142437 -0.3831652 -1.3690487 0.2052515 0.1333069 0.0232548 -0.4512066 -0.0146799 0.1301718 -0.0389587 -0.3646413 -1.1139894 -0.4100326 0.0495386 0.6359202 -1.0290016 -0.1453932 0.1873723 -0.0282795 -0.2201338 -0.9322196 0.4024702 0.1070356 0.45186 -0.7285577 -0.0995097 0.1239313 -0.0958847 -0.3754482 1.4738383 0.1318217 -0.0853265 0.0885696 0.3794188 -0.1132391 -0.395286 -0.1809246 0.4822864 -0.3174761 -0.0717276 -0.0652637 -0.1711031 0.0338147 0.048752 0.0560801 0.0178385 -0.1088256 0.6034733 0.0409924 0.2178308 0.1069588 0.3930245 0.1430167 0.1656833 0.0994925 0.3832183 0.5078907 0.1932706 -0.0905956 0.2425936 0.3511329 0.0420297 0.0550339 0.1450054 0.1513784 1.2152899 0.0388725 -0.0850019 -0.0488119 1.8046959 0.2113824 -0.0533916 0.1634816 0.328473 0.4679928 -0.0685721 -0.061429 -0.7835111 0.3740934 0.109174 -0.2388221 0.0378694 0.0237621 -0.5224592 -0.2102368 0.0234744 -0.7258942 0.8538356 0.1603084 -0.009247 0.1012712 0.0099787 1.823422 -0.3110381 -0.2069144 0.0066603 0.8649452 0.0786451 -0.1935404 0.1085302 0.3262447 0.0509793 -0.0179912 -0.0095273 0.0486979 -0.0017188 -0.0099083 -0.0172791 -0.0080416 0.0405378 0.1008434 -0.0047912 -0.000323 0.0189189 -0.0288441 0.0895908 0.0041598 0.065318 0.0365958 0.0512824 0.0591828 0.0402885 0.0612986 0.0049047 -0.0880507 0.0593093 -0.0345215 0.0452134 -0.0635582 0.0729024 0.0241985 0.0838332 -0.0953986 -0.0738529 0.0145039 -0.0805031 -0.0276568 0.0017432 0.0557775 0.0079705 -0.0107583 -0.1372115 -0.0486487 -0.0261157 -0.1207542 0.0327561 -0.0841255 -0.066804 0.0993755 -0.0473564 0.0649343 0.0043023 0.1011025 0.0436338 -0.0424252 0.1112291 -0.0781556 0.0016783 -0.0505924 0.0589425 -0.0137336 0.0128855 -0.0094096 0.167258 0.1278119 -0.0476343 0.1116342 -0.0836084 0.3392926 -0.0310873 0.1905059 -0.0063485 0.2455662 0.1923321 0.0415159 0.0238022 0.0658565 0.1930968 -0.0229254 0.0223523 -0.0195549 0.336181 unknown
polarizability: 160.3633485|-2.2604674|111.0018343|-7.9744203|4.8733669|68.4782672 unknown
InChI: InChI=1S/C8H9FN2O4/c9-5-2-11(8(14)10-7(5)13)6-1-4(12)3-15-6/h2,4,6,10,12H,1,3H2
charge 0 multiplicity 1
24 atoms
F  -2.306458 2.494681 0.385546
O  1.79922 0.240215 -1.457446
O  4.182378 0.801004 1.299307
O  -0.679762 -2.71804 -0.389143
O  -4.180461 0.303194 0.388494
N  -0.145489 -0.427424 -0.193764
N  -2.387749 -1.158187 -0.008762
C  1.294648 -0.700569 -0.429054
C  2.186577 -0.510959 0.818399
C  3.499728 0.054137 0.244799
C  2.985933 0.948243 -0.91279
C  -1.046425 -1.525013 -0.215209
C  -0.583054 0.881321 -0.001178
C  -1.903841 1.173386 0.200871
C  -2.945759 0.139581 0.213915
H  1.335781 -1.725517 -0.831452
H  2.32505 -1.449849 1.374978
H  1.761386 0.244847 1.50366
H  4.137708 -0.761485 -0.153084
H  2.699683 1.941118 -0.509112
H  3.69436 1.07258 -1.747848
H  0.173391 1.667141 -0.050799
H  5.111199 1.004137 1.023928
H  -3.057643 -1.93474 -0.017657
