program: Gaussian 09
title: 000149475
version: EM64L-G09RevD.01
frameworkgroup: C1[X(C11H12N2OS)]
method: RPBEPBE
basis: SDD
operation: Freq
keyword: #p
keyword: freq=noraman
keyword: PBEPBE/SDD
title: #p freq=noraman PBEPBE/SDD
converged: YES YES NO NO
title: Mulliken charges:
elementType: S O N N C C C C C C C C C C C H H H H H H H H H H H H
charge: 0.122050 -0.185336 -0.380365 0.041430 -0.664536 -0.390891 0.130524 0.315100 -0.118617 0.126533 -0.373979 -0.402656 -0.792408 -0.246440 -0.219561 0.265398 0.281145 0.240474 0.239749 0.340002 0.251013 0.236867 0.267595 0.213195 0.236071 0.234961 0.232682
chargesum: 0.00000
title: Mulliken charges with hydrogens summed into heavy atoms:
elementType: S O N N C C C C C C C C C C C
charge: 0.122050 -0.185336 -0.040362 0.041430 -0.117993 0.089332 0.130524 0.315100 -0.118617 0.126533 -0.122966 -0.165789 -0.075547 -0.011479 0.013121
polarizability: 2.25576150e+02 9.04281710e+00 1.61181315e+02 -5.31575693e+00 1.33783175e+00 8.08603026e+01
1716.lowfreq: -3.0930 0.0002 0.0011 0.0021 6.2297 9.8007 29.9081 39.3967 67.7047
frequency: 29.2237 39.3124 67.6792 73.4912 123.6135 137.2773 154.0821 194.2616 204.3478 231.9275 282.9229 298.6962 380.2209 396.0375 450.9486 481.9066 509.9750 554.8675 556.1569 571.9360 628.5371 639.4239 669.9560 697.0407 702.2895 743.9561 783.2827 803.1291 821.3413 867.9971 882.3406 925.5547 956.3086 968.3512 994.2744 994.4964 996.1790 1022.0170 1047.7538 1051.9565 1125.2665 1133.7775 1172.2868 1178.6408 1203.5403 1210.6575 1235.9086 1263.1361 1285.6736 1308.5774 1371.5806 1405.4993 1425.1250 1447.3380 1451.4606 1458.1817 1463.1299 1472.9888 1481.0790 1579.5161 1606.8329 1631.7517 1676.3650 2990.5600 2992.4978 3042.7580 3064.8550 3077.9108 3093.0793 3120.1800 3128.1863 3129.2297 3144.6220 3164.8215 3537.2403
redmass: 5.9038 4.9458 5.3869 5.2643 2.1242 1.2717 2.8280 4.3415 5.0224 4.0552 4.0718 7.3177 5.0159 3.1497 3.6408 4.6052 5.0395 6.3564 5.8538 7.1804 3.5121 1.4178 3.3021 5.0063 5.1387 1.6445 2.4740 4.1824 2.6375 2.4168 1.4280 3.3318 1.4308 4.9417 1.4914 1.4121 1.4982 4.5029 1.6017 2.1846 1.5420 1.4436 1.5138 1.0689 2.6201 2.1309 2.8162 1.1617 1.4559 1.2518 7.8459 1.2354 1.9029 1.0868 1.6999 1.0851 1.1325 1.2335 2.0989 6.4885 5.9168 6.0010 9.5701 1.0642 1.0365 1.0615 1.0954 1.0966 1.1009 1.0869 1.0883 1.1091 1.0935 1.1008 1.0770
irintensity: 0.0187 2.5507 1.0620 1.6409 3.8914 0.4175 1.0440 0.8791 7.5239 2.2190 10.9003 3.4807 4.6391 0.4752 7.6252 2.6367 18.1900 44.4589 4.6322 0.2029 32.6507 68.2749 6.8354 23.9542 17.3127 54.8855 12.4624 3.1929 17.6521 1.4618 1.2890 1.5571 1.4424 79.5461 1.3964 0.2848 4.2456 99.1895 16.5564 3.1359 4.1805 5.5417 45.8862 2.1510 19.4492 52.9770 200.0391 10.0375 10.1788 16.7695 3.9785 24.5744 24.4392 3.7260 620.7661 24.6117 71.6473 39.6806 54.5166 13.4534 6.1386 79.1353 251.0865 45.9209 18.6744 20.4447 28.2049 11.7445 24.3708 8.8701 3.5507 13.5274 26.9999 26.5995 24.0865
temp: 298.150 k
press: 1.00000 atm
elementType: 16 8 7 7 6 6 6 6 6 6 6 6 6 6 6 1 1 1 1 1 1 1 1 1 1 1 1
symmnumber: 1
zpe: 550338.0 jmol-1
zpe.correction: 0.209613 hartree
zpe.thermalcorrener: 0.223825 hartree
zpe.thermalcorrenthalpy: 0.224770 hartree
zpe.thermalcorrgfe: 0.166818 hartree
zpe.sumelectzpe: -1008.072045 hartree
zpe.sumelectthermal: -1008.057832 hartree
zpe.sumelectthermalent: -1008.056888 hartree
zpe.sumelectthermalfe: -1008.114839 hartree
dipole: -0.0721 -2.4682 1.5256
dipole: 2.9025
quadrupole: -68.9357 -98.1216 -98.5258
quadrupole: 3.5887 -1.8422 5.0177
quadrupole: 19.5920 -9.5939 -9.9981 3.5887 -1.8422 5.0177
hfenergy: -1008.2816572 hartree
pointgroup: C01 [X(C11H12N2O1S1)]
dipole: -0.1322893 -0.4211407 1.0531767 debye
polarizability: 226.2961222|-5.4380259|134.7402744|-8.5232138|-36.7229068|106.5813712 unknown
InChI: InChI=1S/C11H12N2OS/c1-8-4-2-3-5-9(8)10(14)13-11-12-6-7-15-11/h2-5,13H,6-7H2,1H3
charge 0 multiplicity 1
27 atoms
S  3.252857 -1.380605 1.405037
O  0.285778 0.979633 -1.570948
N  0.949902 -0.180651 0.372297
N  3.059621 0.473371 -0.616896
C  4.845397 -0.53733 0.820794
C  4.492446 0.108526 -0.559974
C  -1.435452 0.110654 -0.067827
C  -2.433661 1.122061 -0.233022
C  2.338539 -0.195352 0.219372
C  -0.017407 0.361009 -0.520336
C  -1.78814 -1.159557 0.464086
C  -3.756501 0.818569 0.17728
C  -2.122198 2.487521 -0.817015
C  -3.114552 -1.442863 0.85001
C  -4.102396 -0.442994 0.710859
H  5.634082 -1.299568 0.734033
H  5.124404 0.217463 1.572699
H  5.106698 1.010147 -0.72855
H  4.700527 -0.602426 -1.38415
H  0.588949 -0.575507 1.243622
H  -1.031132 -1.950314 0.534665
H  -4.528683 1.589424 0.071376
H  -1.892667 2.409686 -1.893968
H  -2.97726 3.1719 -0.682773
H  -1.230427 2.943662 -0.351569
H  -3.373704 -2.430963 1.244472
H  -5.136822 -0.644695 1.010326
