program: Gaussian 09
title: 000149481
version: EM64L-G09RevD.01
frameworkgroup: C1[X(C13H16N2O4)]
method: RPBEPBE
basis: SDD
operation: Freq
keyword: #p
keyword: freq=noraman
keyword: PBEPBE/SDD
title: #p freq=noraman PBEPBE/SDD
converged: YES YES NO NO
title: Mulliken charges:
elementType: O O O O N N C C C C C C C C C C C C C H H H H H H H H H H H H H H H H
charge: -0.406229 -0.298577 -0.327816 -0.429197 -0.208778 -0.420882 -0.059585 -0.508935 -0.087895 -0.497971 -0.450514 0.177358 0.088565 0.464968 -0.463826 -0.600341 0.198472 0.170625 -0.523048 0.264173 0.226331 0.232194 0.286485 0.227221 0.258514 0.210490 0.239465 0.301565 0.325650 0.293164 0.233298 0.383704 0.230279 0.233668 0.237404
chargesum: 0.00000
title: Mulliken charges with hydrogens summed into heavy atoms:
elementType: O O O O N N C C C C C C C C C C C C C
charge: -0.080579 -0.298577 -0.327816 -0.045493 -0.208778 -0.119317 0.204589 -0.050410 0.198591 -0.012236 -0.000558 0.177358 0.088565 0.464968 -0.170662 -0.367043 0.198472 0.170625 0.178303
polarizability: 2.45858649e+02 6.68254884e+00 1.78331032e+02 4.88939660e+00 -4.30568928e+00 9.95023387e+01
1716.lowfreq: -7.6558 -0.0007 -0.0004 0.0008 5.8172 8.6728 37.0535 49.5564 70.7607
frequency: 37.0344 49.5520 70.7489 102.2923 122.1561 134.6872 150.4227 168.3670 189.6674 198.7153 227.5091 238.2682 256.0358 271.0290 296.1417 319.0638 346.4043 367.2816 389.8059 404.2539 433.3858 448.1858 459.5847 489.3886 518.9597 528.3067 574.1010 605.8470 636.3234 646.2723 681.3797 691.5386 723.3933 741.0843 757.3253 792.2069 811.8647 840.9965 856.0337 885.5112 906.0974 937.7560 941.5059 977.8140 993.9781 1020.5059 1049.3121 1082.3671 1084.8986 1117.3416 1123.8090 1139.0435 1155.8259 1166.3456 1175.2606 1185.5243 1189.4250 1236.9974 1242.3401 1250.1388 1269.8644 1277.0790 1281.2534 1291.5407 1312.1039 1317.0854 1321.6205 1338.6736 1362.8906 1392.8289 1397.6415 1437.6659 1452.8245 1462.7662 1463.0453 1472.1431 1476.8549 1482.1385 1506.8296 1516.5567 1534.0383 1594.0512 1656.5014 2941.0832 2968.7852 2994.3737 3010.1938 3016.5672 3047.4206 3058.5883 3071.1191 3100.1599 3121.3170 3127.2729 3140.9691 3162.0947 3499.9667 3542.0993 3577.9857
redmass: 3.9044 6.2725 3.7573 5.4447 5.0237 3.7937 3.3209 3.3477 1.8729 1.4066 1.7126 3.4433 2.8417 3.6463 5.0230 4.8931 1.3523 4.1742 3.6518 4.5926 3.0141 3.3231 5.4221 5.4153 5.8943 1.1086 3.6449 5.7707 5.6629 4.7460 2.6642 4.2532 3.6830 5.5637 5.4879 3.9888 3.2923 1.8037 2.5167 2.5490 1.6195 2.2740 3.0262 3.6015 2.6694 1.8479 3.9236 1.6723 2.5879 1.2574 2.1218 2.0041 1.5711 2.0420 2.6729 2.0223 1.5394 1.3556 1.4928 1.6493 2.4436 1.4403 1.9427 1.5679 1.6265 1.3671 2.0698 1.7302 1.4683 1.6791 1.6011 1.2119 1.7423 1.0488 1.0894 1.5252 1.0835 1.1023 3.5809 2.3523 7.7261 5.4009 7.0927 1.0680 1.0321 1.0769 1.0722 1.0658 1.0950 1.1043 1.0992 1.1010 1.0882 1.1008 1.0914 1.0904 1.0645 1.0658 1.0771
irintensity: 7.7176 0.0858 5.8208 3.1651 1.4435 0.6527 7.2115 1.6943 49.5953 90.0275 0.6044 4.2041 2.8138 1.6778 1.5907 8.4171 67.5202 13.4967 4.7750 16.8222 16.2186 9.5463 1.6933 0.4271 29.0267 149.9226 6.8024 0.5766 3.6058 11.4046 8.3499 8.2897 6.6995 37.0290 29.4657 24.6088 54.1641 39.0868 9.9865 50.1235 18.0115 43.7256 14.1699 48.2631 16.6744 32.8819 22.1217 61.6649 42.0796 0.1583 1.3480 22.8668 17.9172 131.7513 68.1496 49.1135 233.6025 4.2809 22.7931 57.8927 44.3548 8.9006 166.1088 16.6096 13.9991 3.4598 211.9083 107.9739 26.6417 115.4358 34.6118 6.8659 54.9618 14.5644 11.4488 6.9448 69.6925 28.0409 243.2524 120.3183 251.8488 106.0678 85.1974 69.8634 54.0610 15.5303 49.8996 18.4139 29.1957 40.7392 31.8814 26.6547 8.5363 26.7365 8.4317 10.9719 113.1513 5.7690 33.8019
temp: 298.150 k
press: 1.00000 atm
elementType: 8 8 8 8 7 7 6 6 6 6 6 6 6 6 6 6 6 6 6 1 1 1 1 1 1 1 1 1 1 1 1 1 1 1 1
symmnumber: 1
zpe: 732326.4 jmol-1
zpe.correction: 0.278928 hartree
zpe.thermalcorrener: 0.296496 hartree
zpe.thermalcorrenthalpy: 0.297440 hartree
zpe.thermalcorrgfe: 0.233974 hartree
zpe.sumelectzpe: -913.956795 hartree
zpe.sumelectthermal: -913.939228 hartree
zpe.sumelectthermalent: -913.938284 hartree
zpe.sumelectthermalfe: -914.001750 hartree
dipole: -1.7159 -4.0992 1.1131
dipole: 4.5811
quadrupole: -97.0445 -111.0225 -110.9584
quadrupole: 25.7685 -1.5709 2.6347
quadrupole: 9.2973 -4.6807 -4.6166 25.7685 -1.5709 2.6347
hfenergy: -914.2357237 hartree
pointgroup: C01 [X(C13H16N2O4)]
dipole: -0.6889219 1.6408737 -0.2852524 debye
polarizability: 245.9786468|-5.6097566|178.3367092|-5.2894675|3.1030197|99.376664 unknown
InChI: InChI=1S/C13H16N2O4/c1-19-11-4-8-9(5-10(11)16)14-6-7-2-3-12(17)15(7)13(8)18/h4-5,7,12,14,16-17H,2-3,6H2,1H3
charge 0 multiplicity 1
35 atoms
O  -3.443821 -2.045789 -1.295906
O  -0.631843 -2.097449 0.40762
O  4.194601 -0.93266 -0.459697
O  4.37333 1.737513 -0.366444
N  -1.988247 -0.352105 -0.251093
N  -0.357111 2.332512 0.257129
C  -2.315576 1.055062 -0.599443
C  -3.870996 1.050976 -0.693486
C  -3.185779 -1.20606 -0.114313
C  -4.310298 -0.181085 0.139129
C  -1.765619 2.031436 0.474382
C  -0.725177 -0.86798 0.075007
C  0.515518 -0.021747 -0.026573
C  0.670355 1.406398 0.046912
C  1.698866 -0.818989 -0.175499
C  1.98242 1.968076 -0.073148
C  2.964206 -0.255554 -0.290129
C  3.107559 1.16482 -0.246996
C  4.144798 -2.395437 -0.493855
H  -1.85574 1.336834 -1.56622
H  -4.186395 0.940637 -1.747919
H  -4.306215 1.995009 -0.324254
H  -3.03191 -1.946783 0.681952
H  -4.34824 0.070514 1.214975
H  -5.289892 -0.587014 -0.158218
H  -2.316919 2.987387 0.417147
H  -1.952289 1.591634 1.477895
H  -0.074819 3.309966 0.300744
H  -3.480232 -1.469363 -2.102596
H  1.542763 -1.901658 -0.179826
H  2.124824 3.053027 -0.018073
H  5.033626 1.000202 -0.469512
H  3.532342 -2.748049 -1.345555
H  3.730285 -2.797608 0.450048
H  5.187025 -2.724276 -0.618185
