program: Gaussian 09
title: 000149464
version: EM64L-G09RevD.01
frameworkgroup: C1[X(C18H10O)]
method: RPBEPBE
basis: SDD
operation: Freq
keyword: #pfreq=noraman
keyword: PBEPBE/SDD
title: #p freq=noraman PBEPBE/SDD
converged: NO YES NO YES
title: Mulliken charges:
elementType: O C C C C C C C C C C C C C C C C C C H H H H H H H H H H
charge: -0.187273 -0.072466 0.107623 0.348450 0.012032 0.199095 -0.657210 0.513244 0.482190 -0.708928 -0.019691 0.487985 -0.405336 -0.467006 -0.476263 -0.470867 -0.486378 -0.458227 -0.232330 0.261438 0.261419 0.254499 0.267250 0.244894 0.244286 0.237123 0.247471 0.244487 0.228489
chargesum: 0.00000
title: Mulliken charges with hydrogens summed into heavy atoms:
elementType: O C C C C C C C C C C C C C C C C C C
charge: -0.187273 -0.072466 0.107623 0.348450 0.012032 0.199095 -0.134354 0.513244 0.482190 -0.454429 -0.019691 0.487985 -0.138086 -0.222112 -0.231976 -0.233744 -0.238907 -0.213740 -0.003840
polarizability: 3.35138229e+02 -1.55229853e+01 2.35120757e+02 -7.18983962e-03 -4.31351616e-03 7.57840247e+01
1716.lowfreq: -7.2449 -0.0009 0.0002 0.0006 1.7783 7.6455 75.6791 112.0360 147.0590
frequency: 75.6787 112.0359 147.0588 176.6084 243.8304 255.5079 267.5161 304.6548 346.5974 397.6340 401.7837 418.0986 479.8553 488.0510 505.5117 521.8596 526.2589 544.2362 561.7967 579.6095 616.3064 623.7674 658.2255 681.3586 702.7437 746.7299 753.3925 778.5637 786.7014 827.5629 853.0344 864.9098 866.7301 893.3732 922.9132 929.6669 957.6531 976.6004 983.6459 986.7507 993.8578 1036.2986 1053.3390 1093.3890 1123.3566 1136.0591 1154.8786 1178.2376 1191.6980 1201.6359 1230.0529 1239.7645 1246.6619 1272.3907 1316.1331 1370.2155 1386.6259 1413.4558 1417.5654 1426.7647 1439.5443 1453.6548 1473.5321 1490.1813 1512.6289 1558.8768 1594.2508 1602.4137 1612.8620 1630.4781 1649.0532 3005.1974 3057.2668 3121.3691 3123.7564 3129.7446 3130.3295 3133.6215 3146.0005 3157.0115 3157.5994
redmass: 7.6736 4.2452 3.3358 4.1579 8.7498 3.9846 3.9190 3.5351 6.2589 6.5041 7.6589 3.9605 3.4123 4.6704 3.3136 7.4499 3.1210 5.5967 5.8901 3.3938 5.4754 3.4255 5.2900 7.0064 3.3982 6.1043 2.5577 1.3405 4.7249 1.8048 3.0653 6.0658 1.5695 1.6645 1.5949 5.1860 1.9833 1.3647 6.7951 1.4288 1.4150 3.9454 2.9974 2.1049 1.1835 1.7941 1.4203 1.4958 1.2852 1.6220 2.1020 1.7690 1.7247 3.2268 3.3904 2.7723 4.1154 1.2382 1.8894 2.7965 4.5240 6.5132 5.3446 3.9084 5.6144 5.6214 8.0136 7.5366 8.0262 10.8606 9.3933 1.0608 1.1000 1.0866 1.0864 1.0917 1.0887 1.0918 1.0973 1.0984 1.0958
irintensity: 1.0610 0.0199 12.9787 4.6310 1.1784 0.1742 1.1422 0.0675 4.5708 2.5254 0.4501 0.2163 2.3173 2.8224 0.2886 0.4509 0.0067 0.6288 1.0245 1.8519 15.8256 7.0044 1.6400 3.4952 13.5735 1.3013 17.7130 14.0472 1.3227 0.4766 2.2277 2.2402 36.9450 88.7826 0.3897 10.0349 12.9256 0.0316 17.1717 6.3837 0.2126 4.8156 14.7646 15.7941 0.0447 0.5173 2.5048 2.6511 6.8151 9.1458 1.2058 13.8566 25.2934 37.1248 39.3480 8.3843 13.0629 19.8600 2.2669 4.7750 5.7240 2.3936 75.1163 1.8701 7.3562 0.0608 14.5842 84.4950 147.2743 257.2493 10.0839 9.7795 3.3842 1.5115 0.1502 9.7814 2.2721 18.3828 30.8839 47.5884 7.5255
temp: 298.150 k
press: 1.00000 atm
elementType: 8 6 6 6 6 6 6 6 6 6 6 6 6 6 6 6 6 6 6 1 1 1 1 1 1 1 1 1 1
symmnumber: 1
zpe: 576758.9 jmol-1
zpe.correction: 0.219676 hartree
zpe.thermalcorrener: 0.232011 hartree
zpe.thermalcorrenthalpy: 0.232955 hartree
zpe.thermalcorrgfe: 0.181574 hartree
zpe.sumelectzpe: -765.955900 hartree
zpe.sumelectthermal: -765.943565 hartree
zpe.sumelectthermalent: -765.942621 hartree
zpe.sumelectthermalfe: -765.994003 hartree
dipole: 4.7403 0.0987 0.0001
dipole: 4.7413
quadrupole: -118.6447 -88.3991 -113.0865
quadrupole: -1.3970 -0.0013 -0.0008
quadrupole: -11.9346 18.3110 -6.3764 -1.3970 -0.0013 -0.0008
hfenergy: -766.1755761 hartree
pointgroup: C01 [X(C18H10O1)]
dipole: 1.8637674 -0.0772324 -0.0000352 debye
polarizability: 335.734873|13.4511061|234.5241133|0.0070995|-0.0044606|75.7840247 unknown
InChI: InChI=1S/C18H10O/c19-15-9-13-8-12-3-1-2-10-4-5-11-6-7-14(15)17(13)18(11)16(10)12/h1-8H,9H2
charge 0 multiplicity 1
29 atoms
O  -4.652212 0.667891 -0.000065
C  -1.115607 0.198383 -0.000115
C  0.0655 -0.576039 -0.000043
C  -1.119044 1.637878 -0.000139
C  1.319766 0.103638 -0.000013
C  -2.40719 -0.374171 -0.000122
C  -2.5753 2.083764 -0.000196
C  1.345224 1.55101 -0.000041
C  -0.053506 -2.008234 0.000011
C  0.094551 2.305708 -0.000095
C  -3.394854 0.744633 -0.000214
C  2.530332 -0.673578 0.000058
C  -2.536657 -1.786847 -0.000047
C  -1.367532 -2.583848 0.000006
C  1.17969 -2.765426 0.000074
C  2.411588 -2.120098 0.000101
C  2.617633 2.185255 -0.00001
C  3.777058 0.010839 0.000089
C  3.809415 1.422672 0.000059
H  -2.852152 2.683079 0.887383
H  -2.852057 2.682929 -0.887919
H  0.149022 3.400787 -0.000112
H  -3.528364 -2.25095 -0.000059
H  -1.461217 -3.676331 0.000038
H  1.13383 -3.860621 0.000116
H  3.33503 -2.712037 0.000157
H  2.673245 3.280252 -0.000032
H  4.711835 -0.561739 0.000145
H  4.775573 1.939099 0.000086
