program: Gaussian 09
title: 000149476
version: EM64L-G09RevD.01
frameworkgroup: C1[X(C8H14N2O8)]
method: RPBEPBE
basis: SDD
operation: Freq
keyword: #p
keyword: freq=noraman
keyword: PBEPBE/SDD
title: #p freq=noraman PBEPBE/SDD
converged: NO YES NO NO
title: Mulliken charges:
elementType: O O O O O O O O N N C C C C C C C C H H H H H H H H H H H H H H
charge: -0.264466 -0.224500 -0.460070 -0.467817 -0.442871 -0.473058 -0.170809 -0.308489 0.069009 -0.039261 -0.153079 -0.157988 -0.094035 -0.084368 -0.013645 0.151962 -0.228013 -0.655962 0.229660 0.243877 0.240743 0.254498 0.265143 0.369965 0.382544 0.365332 0.266154 0.256929 0.402305 0.256635 0.235643 0.248034
chargesum: 0.00000
title: Mulliken charges with hydrogens summed into heavy atoms:
elementType: O O O O O O O O N N C C C C C C C C
charge: -0.264466 -0.224500 -0.090105 -0.085273 -0.077540 -0.070753 -0.170809 -0.308489 0.069009 -0.039261 0.076581 0.085889 0.146708 0.170129 0.251498 0.151962 0.295069 0.084350
polarizability: 1.73906203e+02 1.54974049e+00 1.25118889e+02 -8.81618758e+00 4.16703973e+00 9.93945093e+01
1716.lowfreq: -13.2273 -2.8955 0.0004 0.0006 0.0008 3.7745 22.6430 28.8219 38.8963
frequency: 22.4569 28.7451 38.8852 49.8958 79.8456 97.5566 112.9697 128.4383 156.0807 180.0546 202.1269 227.1252 232.6041 267.5235 276.9552 288.2104 309.1405 344.4531 357.6357 381.0850 392.2697 412.0196 421.7392 443.0243 450.4248 499.5428 518.1222 536.1799 565.5012 579.9358 590.1184 602.4624 624.6210 686.2674 718.5320 845.1805 865.5390 909.3032 921.5993 962.1964 967.0117 991.5433 1006.6624 1026.9756 1032.3331 1045.9124 1054.9746 1058.1684 1066.8049 1085.5440 1094.4203 1103.5021 1139.1167 1179.6255 1205.2723 1217.0423 1223.9889 1228.6435 1239.6526 1254.7432 1275.7695 1300.1390 1306.4140 1309.4194 1327.2540 1341.9100 1362.2034 1378.7262 1382.5691 1399.3979 1406.9391 1429.1242 1445.6151 1446.3772 1460.7967 1702.4641 2929.1015 2957.3832 2964.6901 2987.4660 2992.7116 3006.0071 3038.3684 3050.2483 3133.5212 3163.7179 3492.8690 3521.8249 3543.3987 3561.5278
redmass: 5.2737 6.3837 9.5218 7.1424 6.4255 7.5657 4.4993 5.6461 1.1249 5.9468 4.4094 5.3461 4.9123 5.4912 5.1689 3.2420 5.5852 5.8500 5.3050 4.0101 2.2047 1.9285 3.2581 1.3443 3.3756 2.9648 1.2835 3.7401 4.0568 2.6935 3.8654 2.7290 2.3244 4.0407 6.7779 4.5883 6.4721 6.6961 5.8543 4.5739 5.5935 6.0570 5.4786 3.8823 4.2393 1.4611 2.6089 3.8173 2.9554 2.6836 2.1770 3.1933 1.6589 1.3378 3.2760 1.2897 1.2690 1.2151 1.4282 1.2554 1.4664 1.1981 1.2600 1.2011 1.2186 1.3541 1.2551 1.7682 1.5594 1.4564 1.7161 1.4105 1.0770 1.0537 1.5048 9.8637 1.0800 1.0820 1.0360 1.0844 1.0856 1.0857 1.0972 1.0600 1.0993 1.1076 1.0654 1.0642 1.0655 1.0656
irintensity: 0.5317 2.4401 1.7948 0.6679 4.3422 3.5919 1.1609 0.6362 0.5043 1.7596 4.4079 4.7202 1.3573 6.0455 11.0323 9.9536 24.3662 30.3293 1.7733 8.2791 59.8790 66.3855 11.3086 144.2159 45.0295 7.2140 85.0831 38.9289 59.2684 104.4711 36.5433 58.6815 85.1662 17.4182 43.3358 7.2608 16.6840 124.7045 40.7580 14.4454 9.1709 540.2443 127.3836 78.7873 34.7900 16.3662 44.7219 5.7093 2.3315 59.6537 2.4166 152.0242 7.7225 8.4081 29.4123 15.7920 7.5241 15.7729 0.7772 7.2599 19.6154 39.0512 11.0924 15.8998 35.5649 18.8497 4.2071 6.8878 54.7185 19.9076 15.3486 12.0512 3.2965 21.4218 58.2023 221.7061 15.9095 15.6790 15.9460 4.8414 14.0941 75.2300 19.1039 17.4093 20.6202 0.6088 88.8453 32.9052 19.9672 27.2718
temp: 298.150 k
press: 1.00000 atm
elementType: 8 8 8 8 8 8 8 8 7 7 6 6 6 6 6 6 6 6 1 1 1 1 1 1 1 1 1 1 1 1 1 1
symmnumber: 1
zpe: 629033.9 jmol-1
zpe.correction: 0.239586 hartree
zpe.thermalcorrener: 0.258436 hartree
zpe.thermalcorrenthalpy: 0.259380 hartree
zpe.thermalcorrgfe: 0.190922 hartree
zpe.sumelectzpe: -1022.997835 hartree
zpe.sumelectthermal: -1022.978985 hartree
zpe.sumelectthermalent: -1022.978041 hartree
zpe.sumelectthermalfe: -1023.046500 hartree
dipole: -3.1752 -2.0469 1.3291
dipole: 4.0047
quadrupole: -83.3306 -106.0308 -108.3929
quadrupole: 5.1818 1.9841 -0.7410
quadrupole: 15.9208 -6.7794 -9.1414 5.1818 1.9841 -0.7410
hfenergy: -1023.2374213 hartree
pointgroup: C01 [X(C8H14N2O8)]
dipole: -1.2213348 -0.8882005 0.4493363 debye
polarizability: 173.9119204|4.0416019|124.7072314|-7.7750723|5.5408697|99.8004493 unknown
InChI: InChI=1S/C8H14N2O8/c1-9-10(16)2-17-8-5(13)3(11)4(12)6(18-8)7(14)15/h3-6,8,11-14H,2H2,1H3
charge 0 multiplicity 1
32 atoms
O  -0.414548 -0.600051 -0.557903
O  1.466046 0.695912 -1.036912
O  -2.657356 2.833039 0.17945
O  -3.709277 0.310891 1.036113
O  0.194833 3.003448 0.205759
O  -3.491685 -2.312148 0.310785
O  -1.572408 -3.100179 -0.739774
O  2.774856 -0.418708 1.39653
N  3.321016 -0.305413 0.196195
N  4.586762 -0.101074 -0.08289
C  -1.836604 1.655227 0.466633
C  -2.578475 0.357886 0.110696
C  -0.528233 1.851472 -0.320709
C  -1.584488 -0.831615 0.285895
C  0.348656 0.607923 -0.136034
C  -2.147841 -2.190141 -0.128027
C  2.38856 -0.415614 -0.994255
C  5.427234 -0.003148 1.133235
H  -1.596938 1.61582 1.552965
H  -2.918161 0.38942 -0.945809
H  -0.760294 1.973257 -1.398959
H  -1.306512 -0.89264 1.364684
H  0.685474 0.482212 0.913829
H  -3.514228 2.728411 0.667409
H  -4.169001 -0.563124 0.914684
H  -0.440217 3.766589 0.204783
H  1.858474 -1.3783 -0.898324
H  3.008532 -0.350127 -1.896615
H  -3.841927 -3.211453 0.068028
H  5.114153 0.854004 1.761803
H  6.46603 0.127051 0.799401
H  5.331466 -0.907328 1.767035
