program: Gaussian 09
title: 000149474
version: EM64L-G09RevD.01
frameworkgroup: C1[X(C20H12O2)]
method: RPBEPBE
basis: SDD
operation: Freq
keyword: #pfreq=noraman
keyword: PBEPBE/SDD
title: #p freq=noraman PBEPBE/SDD
converged: YES YES NO NO
title: Mulliken charges:
elementType: O O C C C C C C C C C C C C C C C C C C C C H H H H H H H H H H H H
charge: -0.169984 -0.210403 -0.369461 0.233970 -0.044026 0.252623 0.155404 0.536334 0.195543 -0.230850 -0.639977 0.172229 -0.385423 0.034531 -0.410245 0.468957 -0.494506 -0.816235 -0.356069 -0.453442 -0.258553 -0.244143 0.265944 0.256818 0.259259 0.292917 0.229416 0.283055 0.251201 0.252049 0.227950 0.249127 0.232150 0.233841
chargesum: 0.00000
title: Mulliken charges with hydrogens summed into heavy atoms:
elementType: O O C C C C C C C C C C C C C C C C C C C C
charge: -0.169984 -0.210403 -0.103517 0.233970 -0.044026 0.252623 0.155404 0.536334 0.195543 0.025968 -0.087801 0.172229 -0.156006 0.034531 -0.127190 0.468957 -0.243305 -0.564186 -0.128119 -0.204316 -0.026403 -0.010303
polarizability: 4.10204898e+02 -1.39700509e+01 2.52817700e+02 -3.75982193e+00 -3.30718989e+00 9.35157729e+01
1716.lowfreq: -10.3157 -0.0004 0.0003 0.0006 4.3309 7.3991 41.4657 51.2574 86.3003
frequency: 41.3972 51.2545 86.2992 97.6334 135.1925 172.1584 204.7845 230.8063 267.6724 289.1961 301.1920 327.6134 363.5001 387.4212 407.1331 415.2463 446.1856 483.8738 487.2708 504.2622 513.1323 523.9328 535.4749 568.1914 588.8706 601.3736 631.3470 636.0742 672.2700 695.1948 715.0048 754.7014 757.1896 762.2467 789.1710 802.1438 832.0619 842.2661 843.3051 863.0430 872.8382 936.5747 939.0689 964.4806 970.5278 973.0771 993.8757 1003.6455 1007.1064 1023.8909 1046.4143 1077.3615 1097.9985 1109.0890 1141.7212 1161.3775 1172.0961 1178.7827 1181.1488 1199.8510 1214.7959 1254.6052 1257.7043 1267.7953 1285.8396 1300.7558 1334.6366 1351.7933 1381.5508 1406.2873 1409.3909 1414.5131 1426.9423 1445.4619 1452.9132 1483.8377 1525.7135 1555.0578 1577.1197 1585.6713 1608.0210 1629.9101 1649.6605 1652.1666 2857.3022 2964.2143 3089.5733 3124.0032 3126.6139 3133.8011 3137.2470 3145.8191 3155.5897 3166.4733 3167.6963 3174.1327
redmass: 5.9121 7.5044 4.5674 4.0852 5.3702 5.9210 3.8283 4.9927 5.3769 7.4126 4.7826 4.5496 4.1415 6.7025 4.0282 5.5224 3.2562 4.6829 4.1214 5.8575 5.5976 3.5239 3.5805 6.3127 3.0523 6.1499 5.5257 4.1551 3.6919 4.7383 3.0334 3.7891 1.3841 2.7807 5.9625 2.4640 1.5115 3.5605 2.0974 4.7825 1.7069 2.4259 2.7505 1.4247 3.7601 1.5244 1.3580 1.3749 3.8988 2.4959 3.6081 2.1194 1.6788 2.2826 1.6666 1.5340 1.6043 1.1439 1.2813 1.4702 1.6200 1.6123 1.5586 2.3001 1.9895 3.3163 2.7648 3.0680 4.1223 2.2964 1.1540 2.5833 3.9793 5.0161 2.9712 3.3025 6.2532 8.8571 9.8295 5.7859 7.2246 6.2280 9.2354 8.2921 1.0775 1.0669 1.0925 1.0904 1.0876 1.0888 1.0884 1.0868 1.0939 1.0962 1.1000 1.0967
irintensity: 1.0372 0.5674 8.0759 0.0662 3.4491 0.5281 6.2343 0.7892 0.4608 0.9953 2.2736 3.1888 2.5441 21.4453 4.5466 0.4290 7.6637 10.3935 0.5314 1.2513 2.1224 2.0272 0.5586 2.2179 0.0546 2.5123 13.5387 5.3298 7.7773 3.3497 23.3859 2.3328 88.7563 8.2215 4.7198 17.5098 5.0391 0.2345 1.3474 3.2408 16.7954 29.6207 13.5984 2.0405 2.4885 8.6598 0.8231 0.5838 14.9883 12.0041 5.3678 1.5795 6.5687 32.3129 5.0513 19.9626 19.4817 8.7836 2.6634 1.0153 8.4607 57.8751 0.1329 8.2125 113.1153 48.2678 20.2267 51.2644 3.9783 16.2306 22.4635 2.4707 54.7811 13.2029 11.5890 48.9054 6.6811 8.4343 438.8907 13.0230 20.8020 5.5920 203.5765 30.7024 11.6745 0.4393 3.9430 1.5092 3.3519 8.7783 11.3233 0.9627 25.6506 9.0577 16.5968 35.7381
temp: 298.150 k
press: 1.00000 atm
elementType: 8 8 6 6 6 6 6 6 6 6 6 6 6 6 6 6 6 6 6 6 6 6 1 1 1 1 1 1 1 1 1 1 1 1
symmnumber: 1
zpe: 672257.2 jmol-1
zpe.correction: 0.256049 hartree
zpe.thermalcorrener: 0.271607 hartree
zpe.thermalcorrenthalpy: 0.272551 hartree
zpe.thermalcorrgfe: 0.213244 hartree
zpe.sumelectzpe: -918.335464 hartree
zpe.sumelectthermal: -918.319907 hartree
zpe.sumelectthermalent: -918.318963 hartree
zpe.sumelectthermalfe: -918.378270 hartree
dipole: 4.7615 -0.4528 2.2130
dipole: 5.2702
quadrupole: -126.6497 -121.4594 -130.3315
quadrupole: 4.6348 -8.9947 -5.8483
quadrupole: -0.5028 4.6875 -4.1846 4.6348 -8.9947 -5.8483
hfenergy: -918.5915137 hartree
pointgroup: C01 [X(C20H12O2)]
dipole: 1.8582156 0.1405634 -0.9090906 debye
polarizability: 410.4872954|12.3349643|252.3354531|-2.5153433|-6.9980223|93.7156224 unknown
InChI: InChI=1S/C20H12O2/c21-17-10-18(22)16-8-7-14-13-4-2-1-3-11(13)9-12-5-6-15(17)20(16)19(12)14/h1-9,16H,10H2
charge 0 multiplicity 1
34 atoms
O  -3.427758 2.675175 0.892071
O  -4.549089 -1.787029 0.225671
C  -1.809872 1.390687 -0.450956
C  -1.329026 -0.027275 -0.136939
C  0.089114 -0.283067 -0.053811
C  1.043668 0.791006 -0.0821
C  -2.247823 -1.085858 0.016931
C  0.547171 -1.657919 0.091311
C  -3.187141 1.661766 0.194965
C  -0.785056 2.46217 -0.1864
C  -4.221141 0.594418 -0.114345
C  2.450787 0.501496 -0.047932
C  0.539711 2.168435 -0.065862
C  -3.714301 -0.851547 0.050369
C  -1.779215 -2.43986 0.181764
C  2.892155 -0.885503 0.055348
C  -0.425401 -2.718164 0.195664
C  1.933192 -1.924669 0.136098
C  3.464466 1.523578 -0.118392
C  4.301762 -1.178823 0.087193
C  4.819987 1.205079 -0.088032
C  5.246956 -0.161549 0.018486
H  -2.027061 1.405884 -1.549855
H  -1.152495 3.490708 -0.113341
H  -4.507139 0.7071 -1.18315
H  -5.135119 0.735133 0.48521
H  1.246463 2.987745 0.09184
H  -2.535528 -3.223169 0.289937
H  -0.067433 -3.748526 0.300762
H  2.275409 -2.961596 0.239121
H  3.173374 2.573406 -0.213721
H  4.61575 -2.226126 0.166618
H  5.569828 2.001171 -0.14916
H  6.316804 -0.394775 0.042838
