program: Gaussian 09
title: 000149463
version: EM64L-G09RevD.01
frameworkgroup: C1[X(C9H11ClN2O2)]
method: RPBEPBE
basis: SDD
operation: Freq
keyword: #p
keyword: freq=noraman
keyword: PBEPBE/SDD
title: #p freq=noraman PBEPBE/SDD
converged: YES YES NO NO
title: Mulliken charges:
elementType: Cl O O N N C C C C C C C C C H H H H H H H H H H H
charge: -0.064517 -0.312814 -0.257700 -0.364932 -0.505371 0.338677 0.256253 -0.367621 -0.329249 -0.791408 -0.352360 -0.104982 -0.237180 0.133813 0.262261 0.253973 0.227414 0.237255 0.237562 0.247768 0.247141 0.256550 0.374886 0.307199 0.307382
chargesum: 0.00000
title: Mulliken charges with hydrogens summed into heavy atoms:
elementType: Cl O O N N C C C C C C C C C
charge: -0.064517 -0.312814 -0.257700 0.009954 0.109210 0.338677 0.256253 -0.105361 -0.075276 -0.089177 0.142548 -0.104982 0.019370 0.133813
polarizability: 1.93732701e+02 -3.44797121e+00 1.29330180e+02 -9.49773377e-02 4.41591626e-02 6.32129541e+01
1716.lowfreq: -3.9009 -0.0024 0.0017 0.0018 5.4276 9.0582 25.9763 39.7978 67.9970
frequency: 25.9044 39.7933 67.9866 109.0936 124.7224 132.3894 148.4430 165.8864 191.9296 212.7968 224.7369 245.2241 281.4791 334.0809 374.3238 434.4498 441.7463 483.5282 546.1658 553.9635 585.6054 634.5267 668.7654 686.9495 709.8774 764.8628 779.1491 802.7577 858.3537 876.9458 925.2909 933.7602 992.0805 996.8528 1005.9495 1045.5192 1090.7340 1126.7092 1159.5419 1186.5921 1207.0803 1237.3594 1264.6677 1274.3583 1285.0513 1342.9141 1380.2540 1394.1445 1400.3426 1448.3534 1460.8642 1469.2393 1474.0592 1484.4377 1590.5408 1603.1044 1626.6768 1675.6286 2979.9007 2981.4092 3043.7560 3057.8089 3096.8188 3158.1657 3159.4090 3178.7490 3392.8368 3510.1386 3548.1351
redmass: 6.3782 5.9723 5.9854 4.7593 1.2105 1.3017 2.7641 7.0812 2.9470 1.9953 3.8543 7.8158 4.5979 6.5545 6.6640 7.2258 2.9134 4.6504 3.4693 5.1340 3.3215 6.6711 4.9392 1.1000 3.5511 1.8450 3.8941 1.4283 6.3977 1.3464 1.3496 5.8560 1.5336 6.8257 1.8209 1.5142 1.9280 2.1064 4.4220 2.1203 1.0724 3.3905 1.8000 1.4081 1.1594 1.4401 5.4111 3.1190 1.2831 1.2214 1.0457 1.6965 1.3185 1.9035 7.0030 7.0877 8.8075 1.0647 1.0547 1.0381 1.1061 1.0972 1.0992 1.0886 1.0919 1.0969 1.0428 1.0989 1.0792
irintensity: 0.0108 1.5344 0.9608 3.9722 1.8363 21.8468 2.0184 2.2974 9.0456 24.9382 0.5186 1.6101 27.2293 0.0528 2.0551 11.3873 4.6841 5.6598 7.0563 1.1840 18.8395 14.3133 19.5789 129.2954 0.8402 137.5143 14.1415 51.7467 33.0093 17.4593 0.0212 8.8787 6.5432 56.6118 0.0168 6.9704 4.4606 126.8779 7.0919 129.6788 1.3644 108.4130 6.9949 5.2614 0.1587 4.8800 9.4225 20.8350 10.6199 156.4838 14.5849 118.6428 5.6156 123.3814 2.0581 6.3832 260.1947 18.1689 27.7607 18.8282 14.5393 17.4322 21.5730 8.2818 1.2742 3.0259 0.1609 2.2814 56.5422
temp: 298.150 k
press: 1.00000 atm
elementType: 17 8 8 7 7 6 6 6 6 6 6 6 6 6 1 1 1 1 1 1 1 1 1 1 1
symmnumber: 1
zpe: 500611.3 jmol-1
zpe.correction: 0.190673 hartree
zpe.thermalcorrener: 0.205342 hartree
zpe.thermalcorrenthalpy: 0.206286 hartree
zpe.thermalcorrgfe: 0.147437 hartree
zpe.sumelectzpe: -1068.496692 hartree
zpe.sumelectthermal: -1068.482022 hartree
zpe.sumelectthermalent: -1068.481078 hartree
zpe.sumelectthermalfe: -1068.539927 hartree
dipole: -0.5843 1.1703 -0.0038
dipole: 1.3080
quadrupole: -104.9082 -86.8967 -89.5488
quadrupole: -6.3065 0.0381 0.1384
quadrupole: -11.1236 6.8879 4.2358 -6.3065 0.0381 0.1384
hfenergy: -1068.6873643 hartree
pointgroup: C01 [X(C9H11Cl1N2O2)]
dipole: -0.2724701 -0.4168562 0.1297093 debye
dipolederiv: -0.8850731 0.01401 -0.0651674 0.0271964 -0.1267853 0.0211202 -0.0699172 0.0201533 -0.0845795 -1.9395685 0.3603118 -0.2503909 0.3421028 -0.4097827 0.0759639 -0.2406183 0.0771271 -0.3111032 -0.850874 0.3535444 -0.1639687 0.0999466 -0.8186199 0.1730621 -0.0713097 0.1910303 -0.4397354 -0.1351854 -0.0729203 0.0470576 -0.1890364 -0.7461009 0.1030985 0.091267 0.1122899 -0.4583812 -0.1336445 0.0031329 -0.0076446 -0.1055105 -0.4032958 0.1290579 0.0319538 0.1357901 -0.0832741 -0.1331289 0.1510545 -0.0598845 0.2949789 0.1771081 -0.0558284 -0.1113766 -0.066952 -0.0278088 1.5499977 -0.2337321 0.19104 -0.0856503 -0.0525814 0.0383374 0.137346 0.0274759 0.0727767 -0.2143002 -0.0635495 0.015438 0.0097069 -0.0209343 -0.0350193 -0.0102884 -0.0401518 -0.1098582 -0.2379933 0.1038368 -0.0401969 -0.1470335 -0.0151712 -0.0712523 0.0487801 -0.0523055 -0.1650174 -0.0606638 -0.1322626 0.0368832 -0.0870831 -0.0021107 0.0181674 0.0210972 0.0153139 0.0633724 0.3594046 -0.2110387 0.0759699 -0.7266851 0.4389737 -0.0808983 0.2578977 -0.0441528 0.3921442 1.1941936 -0.0049476 0.095837 -0.096292 0.0228567 -0.0409701 0.128155 -0.0343483 -0.0518096 -0.2342311 -0.0486004 0.0081749 0.0585519 0.0074207 -0.0386205 -0.0294413 -0.0468031 -0.1011263 1.0117441 -0.1822911 0.1276409 0.0601374 1.2803564 -0.4040667 0.0398646 -0.421155 0.3195664 0.0697211 0.0435056 -0.0218139 0.053093 -0.0035611 0.0607537 -0.0250898 0.0600699 0.1357208 0.0521492 0.0770159 -0.0356494 0.0864656 -0.0050962 0.0670349 -0.0389166 0.0660267 0.1418714 -0.0024887 0.1501596 -0.0607051 0.0507418 -0.0472884 0.0589999 -0.0258823 0.0661072 0.0859372 0.0001582 -0.0203193 0.123675 0.0061275 0.0463741 -0.0506886 0.130896 -0.0052833 -0.0058362 0.0316084 -0.0879094 -0.0784154 -0.0777306 0.0460377 -0.010246 -0.0983449 -0.0582055 -0.0358192 0.0081833 -0.0139734 0.0599559 0.1102259 0.0229241 0.0480911 -0.0015466 0.0612186 -0.0701004 0.0188697 -0.0375587 -0.0353617 0.0950188 -0.0665062 -0.0397759 -0.0653667 -0.0715012 0.0076226 0.0402793 -0.063132 0.012692 -0.0654459 0.0220993 0.0464829 0.0132804 0.0467512 0.152931 0.2992199 -0.0361439 0.0106004 0.0492454 0.1997399 0.0523845 -0.0210086 0.0469393 0.3146478 0.0960922 -0.0355374 -0.006227 0.1109855 0.305447 0.0891658 -0.0366909 0.0160507 0.0497937 0.0955305 -0.0126551 0.0204607 0.1259431 0.1484963 -0.1543541 -0.0547397 -0.1014854 0.2080653 unknown
polarizability: 193.1786378|0.3967222|121.8534079|9.382282|-20.7369908|71.2437893 unknown
InChI: InChI=1S/C9H11ClN2O2/c1-6-4-7(10)2-3-8(6)14-5-9(13)12-11/h2-4,12H,5,11H2,1H3
charge 0 multiplicity 1
25 atoms
Cl 5.127225 0.045091 0.253089
O  -0.877668 0.157881 -0.229474
O  -3.894396 1.991574 -1.107859
N  -3.476591 -0.158873 -0.292418
N  -4.836156 -0.568941 -0.239299
C  1.141806 -0.998002 0.324374
C  0.529552 0.201922 -0.142107
C  2.549752 -1.021942 0.436322
C  1.297608 1.337846 -0.484367
C  0.29613 -2.201358 0.685658
C  -1.579639 1.354148 -0.708268
C  3.309729 0.115224 0.093324
C  2.706167 1.296349 -0.365848
C  -3.089327 1.092513 -0.721931
H  3.048774 -1.928984 0.790975
H  0.825877 2.257555 -0.841377
H  0.924398 -3.041518 1.024622
H  -0.419836 -1.956616 1.492255
H  -0.30146 -2.542509 -0.180076
H  -1.261818 1.613699 -1.737222
H  -1.382537 2.220017 -0.046028
H  3.310777 2.168984 -0.627408
H  -2.771973 -0.836478 0.005761
H  -5.253374 -0.548923 -1.181051
H  -5.368618 0.038942 0.399653
