program: Gaussian 09
title: 000149458
version: EM64L-G09RevD.01
frameworkgroup: C1[X(C14H10N2O4)]
method: RPBEPBE
basis: SDD
operation: Freq
keyword: #p
keyword: freq=noraman
keyword: PBEPBE/SDD
title: #p freq=noraman PBEPBE/SDD
converged: NO YES NO NO
title: Mulliken charges:
elementType: O O O O N N C C C C C C C C C C C C C C H H H H H H H H H H
charge: -0.202659 -0.202657 -0.203900 -0.203901 0.019499 0.019499 -0.605463 -0.605457 0.412284 0.412282 0.205108 0.205090 -0.591421 -0.591430 -0.346403 -0.346391 0.410194 0.410178 -0.415961 -0.415939 0.240988 0.247477 0.241011 0.247468 0.296656 0.296659 0.242809 0.242803 0.290795 0.290784
chargesum: 0.00000
title: Mulliken charges with hydrogens summed into heavy atoms:
elementType: O O O O N N C C C C C C C C C C C C C C
charge: -0.202659 -0.202657 -0.203900 -0.203901 0.019499 0.019499 -0.116997 -0.116979 0.412284 0.412282 0.205108 0.205090 -0.294765 -0.294771 -0.103594 -0.103588 0.410194 0.410178 -0.125166 -0.125155
polarizability: 3.74255634e+02 9.79270985e-03 1.87883546e+02 -7.47535668e-01 -1.22261697e-02 7.83593721e+01
1716.lowfreq: -7.5162 -2.8861 -0.0007 -0.0006 -0.0006 4.3684 34.0061 50.3251 61.0129
frequency: 34.0059 50.3250 61.0127 82.1760 107.0708 126.8976 182.4761 191.4671 213.7638 230.0306 243.8518 323.3880 351.5917 366.0648 403.7660 425.7910 457.6137 463.5199 502.9842 508.9141 537.6808 539.0956 555.0408 558.6096 612.4254 652.9534 692.5347 702.0831 705.7623 729.3833 745.4599 750.1099 767.1088 847.5942 856.9652 860.6147 878.7086 903.3542 932.2744 941.5383 986.2046 989.9418 995.9156 1006.9559 1043.5618 1079.5295 1091.7049 1125.3757 1141.9709 1162.0833 1194.1269 1195.3053 1209.4023 1213.9854 1224.0481 1268.2027 1272.9340 1298.2014 1316.9341 1345.2962 1359.1143 1367.1765 1388.7143 1395.6189 1426.2154 1433.4815 1454.1484 1459.8021 1474.9613 1495.1554 1575.4124 1592.6764 1606.2856 1614.6826 2969.1622 2977.6115 3057.5514 3058.8072 3152.5149 3159.3281 3168.0071 3168.1672 3187.0465 3187.8502
redmass: 9.9349 13.4754 9.6495 7.9572 4.5784 6.1871 5.0109 6.0789 11.0630 4.3748 3.0197 4.4227 4.5545 7.6482 3.7296 5.2105 3.9199 3.0720 4.4092 7.3419 6.0116 5.3079 4.7020 4.9542 3.2949 6.9253 4.8372 5.8750 6.2966 5.5225 9.7483 4.1357 3.5408 1.3849 1.6373 3.1476 5.4800 2.5504 1.4191 1.4162 1.3786 1.3487 7.4682 2.2299 2.1725 2.1340 1.8196 2.2523 1.3785 1.2118 1.6316 2.8179 2.7914 7.0753 2.3979 1.3766 1.6044 2.1035 1.5333 1.7030 6.2298 10.3346 7.2626 6.0845 5.0961 3.1621 1.3385 1.1113 2.0583 3.0194 7.7551 8.1334 6.5813 7.4159 1.0689 1.0634 1.0929 1.0984 1.0901 1.0884 1.0923 1.0922 1.0955 1.0957
irintensity: 4.2973 0.0003 0.0407 3.2265 0.6824 1.7984 0.6538 0.0350 0.3371 9.5329 0.0021 1.5333 0.2673 4.3724 1.4827 0.6918 4.9277 1.1045 1.9178 0.9392 0.2789 0.2040 0.0388 0.1832 3.8791 1.1182 0.8280 25.6908 0.0610 40.4708 0.2573 39.8285 0.0229 59.9738 3.4401 13.7049 2.0403 17.8151 1.1800 42.6116 0.1201 4.5450 4.1712 0.5031 0.7973 0.9533 64.1337 14.7643 17.9576 18.7297 0.0052 259.4838 3.7080 781.8036 2.8199 9.6644 3.8294 0.0039 0.4148 3.5274 123.3158 8.4940 93.9367 1.0430 64.0381 0.7000 13.5584 19.8775 18.1796 5.4120 0.8703 30.3024 0.6637 41.7934 10.7985 22.9658 25.5515 14.6961 2.2731 9.1822 2.3608 0.5902 3.3714 0.0070
temp: 298.150 k
press: 1.00000 atm
elementType: 8 8 8 8 7 7 6 6 6 6 6 6 6 6 6 6 6 6 6 6 1 1 1 1 1 1 1 1 1 1
symmnumber: 1
zpe: 568149.5 jmol-1
zpe.correction: 0.216397 hartree
zpe.thermalcorrener: 0.231950 hartree
zpe.thermalcorrenthalpy: 0.232894 hartree
zpe.thermalcorrgfe: 0.172420 hartree
zpe.sumelectzpe: -948.357123 hartree
zpe.sumelectthermal: -948.341570 hartree
zpe.sumelectthermalent: -948.340626 hartree
zpe.sumelectthermalfe: -948.401099 hartree
dipole: 0.0003 0.7473 0.0189
dipole: 0.7475
quadrupole: -189.9280 -102.6153 -113.9774
quadrupole: -0.0129 -0.1458 -0.0051
quadrupole: -54.4211 32.8916 21.5295 -0.0129 -0.1458 -0.0051
hfenergy: -948.5735199 hartree
pointgroup: C01 [X(C14H10N2O4)]
dipole: 0.0001008 0.2940027 0.0074607 debye
polarizability: 374.2536291|0.0225218|187.8835491|-1.0729807|0.0004729|78.3613731 unknown
InChI: InChI=1S/C14H10N2O4/c17-15(18)11-3-5-13-9(7-11)1-2-10-8-12(16(19)20)4-6-14(10)13/h3-8H,1-2H2
charge 0 multiplicity 1
30 atoms
O  5.668503 -1.332109 -0.201141
O  -5.668609 -1.33338 0.193587
O  5.62353 0.91914 0.169555
O  -5.623569 0.917833 -0.177194
N  5.040468 -0.219367 -0.012414
N  -5.040504 -0.219208 0.01373
C  0.639752 2.208348 0.432941
C  -0.639732 2.208346 -0.432021
C  1.441409 0.937736 0.198888
C  -1.441414 0.937756 -0.197931
C  0.742626 -0.296497 -0.008952
C  -0.742655 -0.296483 0.009952
C  2.849204 0.952236 0.197132
C  -2.849208 0.952279 -0.196197
C  1.4915 -1.486685 -0.227572
C  -1.491553 -1.48665 0.228606
C  3.557806 -0.249716 -0.01087
C  -3.557838 -0.249629 0.011973
C  2.896189 -1.477117 -0.229295
C  -2.896242 -1.477059 0.230301
H  0.354945 2.271745 1.503607
H  1.256208 3.09729 0.212095
H  -0.35492 2.271705 -1.502688
H  -1.256172 3.097306 -0.211204
H  3.408043 1.879217 0.354632
H  -3.408026 1.879275 -0.353679
H  0.974193 -2.429713 -0.427447
H  -0.974265 -2.429679 0.428522
H  3.482113 -2.383101 -0.402146
H  -3.482181 -2.383018 0.403229
