program: Gaussian 09
title: 000149448
version: EM64L-G09RevD.01
frameworkgroup: C1[X(C11H13N3O3)]
method: RPBEPBE
basis: SDD
operation: Freq
keyword: #p
keyword: freq=noraman
keyword: PBEPBE/SDD
title: #p freq=noraman PBEPBE/SDD
converged: YES YES NO NO
title: Mulliken charges:
elementType: O O O N N N C C C C C C C C C C C H H H H H H H H H H H H H
charge: -0.275522 -0.251684 -0.232061 -0.166680 0.056235 0.004657 -0.209297 -0.478148 -0.486958 -0.005905 0.449766 -0.317828 -0.492722 0.326410 -0.194439 -0.329580 -0.756861 0.269427 0.251194 0.246260 0.258690 0.248990 0.314227 0.289745 0.246934 0.232584 0.245277 0.263937 0.244005 0.249347
chargesum: 0.00000
title: Mulliken charges with hydrogens summed into heavy atoms:
elementType: O O O N N N C C C C C C C C C C C
charge: -0.275522 -0.251684 -0.232061 -0.166680 0.056235 0.004657 0.060131 0.019306 0.020722 0.308323 0.449766 -0.028083 -0.245788 0.326410 0.038145 -0.084303 0.000428
polarizability: 1.81030650e+02 -1.50745644e+00 1.44645789e+02 6.90250256e+00 3.21812360e+00 1.06093504e+02
1716.lowfreq: -14.7210 -3.0476 0.0001 0.0004 0.0005 6.7616 28.6084 41.4170 44.2079
frequency: 28.5220 41.0677 44.1871 59.1499 63.2109 76.2586 117.0203 152.0499 187.2116 198.5889 215.9775 282.9019 288.1403 313.2223 340.9673 396.9269 410.7441 471.6081 503.6221 533.4541 556.5049 571.9816 595.6455 620.7029 656.3588 728.0018 763.2765 772.2878 812.8153 830.7918 847.7589 868.3181 907.3053 927.6037 941.8012 953.1309 983.8764 987.7802 1001.9790 1005.4250 1027.0540 1040.4404 1043.2785 1066.5371 1090.7171 1119.3072 1154.6603 1169.8850 1189.5362 1195.8125 1207.4759 1238.0688 1245.4573 1281.9857 1295.0763 1310.5215 1317.6019 1325.2714 1334.9703 1345.5187 1364.2756 1383.8767 1418.9102 1452.6723 1454.8960 1459.1715 1467.8077 1475.2204 1559.2675 1587.4179 1668.5017 3007.4636 3020.4543 3031.6448 3035.8696 3044.3632 3094.9534 3099.7173 3105.4173 3106.5765 3133.5057 3142.8884 3146.1215 3166.9229
redmass: 6.6192 5.3044 4.7591 2.7393 4.0853 1.4113 3.7821 3.4949 6.8306 3.7522 5.4024 6.5536 3.3904 4.0464 6.8743 3.2297 4.2728 5.3474 4.5133 3.9624 3.3342 3.7142 5.1716 5.3096 4.1077 2.0098 5.2511 3.6759 2.2731 2.7143 4.0408 2.0163 2.9109 1.4093 4.4768 1.4388 2.3783 1.9619 1.6101 2.6267 3.3670 2.2469 2.0269 2.3170 2.1703 1.7913 2.2853 1.5494 2.0360 2.4949 1.5558 1.5918 1.6951 1.4278 1.8170 2.5947 2.1976 1.4508 1.3579 1.8140 1.7743 1.2454 2.0189 1.0556 1.0522 1.9063 1.1396 1.0940 5.5163 5.5071 9.8032 1.0376 1.0649 1.0641 1.0828 1.0848 1.1015 1.0955 1.0914 1.1043 1.0880 1.1018 1.0924 1.1001
irintensity: 1.9611 1.3981 0.8657 3.8080 3.2268 0.8420 3.0340 2.3381 0.1643 8.0394 4.0992 1.4502 0.5233 0.6552 3.0809 5.5749 3.4487 1.9158 4.0307 6.2625 4.1002 2.8185 1.2219 1.1418 8.1874 33.1562 20.5557 1.2698 31.6367 28.2458 22.6460 30.7152 57.3313 1.9367 125.0326 1.6039 48.7413 19.3266 5.4830 11.0020 5.6904 8.0883 24.6033 65.9739 98.1273 3.0349 92.0607 18.7472 159.9435 130.8239 25.3468 8.7869 28.9841 5.2460 30.1085 3.7256 44.5061 6.8932 5.2850 40.3444 11.5142 51.1222 18.2493 23.3591 18.7248 18.4650 12.9504 12.0041 13.4196 0.4886 208.5045 1.0972 19.3468 8.9961 9.6834 16.5258 9.6198 6.0757 28.5853 20.0167 8.0909 9.7948 6.1000 22.4563
temp: 298.150 k
press: 1.00000 atm
elementType: 8 8 8 7 7 7 6 6 6 6 6 6 6 6 6 6 6 1 1 1 1 1 1 1 1 1 1 1 1 1
symmnumber: 1
zpe: 607016.7 jmol-1
zpe.correction: 0.231200 hartree
zpe.thermalcorrener: 0.247096 hartree
zpe.thermalcorrenthalpy: 0.248040 hartree
zpe.thermalcorrgfe: 0.185582 hartree
zpe.sumelectzpe: -815.572599 hartree
zpe.sumelectthermal: -815.556703 hartree
zpe.sumelectthermalent: -815.555759 hartree
zpe.sumelectthermalfe: -815.618218 hartree
dipole: -0.6401 1.4217 -3.5206
dipole: 3.8504
quadrupole: -123.9068 -82.0329 -106.5259
quadrupole: 6.9399 -2.3023 6.1573
quadrupole: -19.7516 22.1223 -2.3707 6.9399 -2.3023 6.1573
hfenergy: -815.8037993 hartree
pointgroup: C01 [X(C11H13N3O3)]
dipole: 0.1309018 -1.3916895 0.5838225 debye
polarizability: 179.3891448|-12.7674127|107.7605591|2.5820125|3.4434354|144.6202392 unknown
InChI: InChI=1S/C11H13N3O3/c1-8(15)17-11-5-4-10(14(11)13-16)9-3-2-6-12-7-9/h2-3,6-7,10-11H,4-5H2,1H3
charge 0 multiplicity 1
30 atoms
O  -2.046716 -0.216439 0.604403
O  -1.952787 2.304687 -1.105887
O  -4.300165 -0.376591 -0.001415
N  -0.573044 0.548587 -1.135059
N  -0.751565 1.906024 -1.334855
N  4.054591 -0.394121 0.397616
C  0.727662 -0.08611 -1.464671
C  0.252195 -1.506835 -1.915268
C  -0.998889 -1.784417 -1.037232
C  -1.651226 -0.401298 -0.821684
C  1.712079 -0.120742 -0.295662
C  1.314773 -0.004058 1.058358
C  3.092725 -0.306432 -0.565323
C  -3.436238 -0.135953 0.864819
C  2.298252 -0.090695 2.069136
C  3.647222 -0.289918 1.698332
C  -3.672055 0.277298 2.297107
H  1.181882 0.46986 -2.303345
H  1.038371 -2.265979 -1.779662
H  -0.023626 -1.475607 -2.984696
H  -1.700505 -2.494092 -1.502853
H  -0.704667 -2.186635 -0.052143
H  -2.546557 -0.197343 -1.437226
H  0.262424 0.163312 1.311461
H  3.453272 -0.381047 -1.60018
H  2.02778 0.000043 3.125884
H  4.437558 -0.36181 2.453902
H  -3.519756 1.368411 2.385757
H  -2.955991 -0.217024 2.973158
H  -4.7051 0.038324 2.588623
