program: Gaussian 09
title: 000149511
version: EM64L-G09RevD.01
frameworkgroup: C1[X(C15H14N6)]
method: RPBEPBE
basis: SDD
operation: Freq
keyword: #pfreq=noraman
keyword: PBEPBE/SDD
title: #p freq=noraman PBEPBE/SDD
converged: YES YES NO NO
title: Mulliken charges:
elementType: N N N N N N C C C C C C C C C C C C C C C H H H H H H H H H H H H H H
charge: -0.468260 -0.061769 -0.658006 -0.382652 -0.656720 -0.374727 0.302401 0.073711 -0.003706 0.380381 -0.523767 0.406903 -0.360319 -0.376880 -0.404146 -0.364987 0.355721 -0.368438 -0.383751 0.055198 0.069561 0.318588 0.292504 0.248675 0.216734 0.279914 0.199114 0.216799 0.286559 0.312585 0.316407 0.211162 0.315100 0.316787 0.213324
chargesum: 0.00000
title: Mulliken charges with hydrogens summed into heavy atoms:
elementType: N N N N N N C C C C C C C C C C C C C C C
charge: -0.149672 -0.061769 -0.029014 -0.171490 -0.024834 -0.161403 0.302401 0.073711 -0.003706 0.380381 -0.231263 0.406903 -0.111645 -0.160146 -0.124232 -0.165873 0.355721 -0.151639 -0.097192 0.055198 0.069561
polarizability: 4.66688653e+02 7.72701128e+00 2.06936958e+02 1.28569281e+00 2.98361429e+00 8.47250020e+01
1716.lowfreq: -0.0002 0.0006 0.0011 2.4958 3.1477 7.8622 25.3775 34.4012 57.6000
frequency: 25.2776 34.3767 57.5991 61.3719 63.2952 86.2748 144.9578 161.4867 202.9949 226.1197 239.0079 274.1776 332.8936 342.2514 351.1846 398.1510 415.8100 421.7528 430.9576 443.4201 447.9398 454.5350 466.0172 483.3110 515.6445 539.7413 549.1999 578.8869 590.5298 604.6973 627.5159 635.9615 651.4520 695.7346 702.0804 728.2390 756.1869 765.7829 776.6868 807.4575 813.2025 819.0207 832.4153 844.7147 867.4519 924.4191 927.2091 932.4839 955.0865 987.3692 993.6329 1007.9121 1036.6724 1040.5398 1066.3887 1070.9695 1077.2557 1100.1542 1120.0142 1138.0786 1144.2860 1197.5705 1219.7051 1243.9783 1267.2849 1296.1683 1304.3310 1328.2106 1364.8053 1374.9356 1386.2147 1395.3838 1419.3129 1442.7545 1475.6547 1500.4864 1540.5022 1566.4203 1578.3412 1597.6453 1598.5551 1624.6703 1633.3334 1636.6295 1640.5523 3120.3226 3128.5040 3130.1493 3162.1812 3166.7279 3168.7066 3170.3872 3326.1364 3327.7978 3537.1247 3537.4397 3607.0181 3681.2996 3681.9533
redmass: 4.7437 5.0747 5.1850 4.3353 4.8574 5.5486 5.8521 5.5008 6.9981 4.5516 4.9185 4.3944 3.9888 5.6912 4.7884 1.9794 1.5526 1.2407 2.5061 2.4346 1.2200 1.2726 5.3982 3.6897 3.5130 3.9202 3.5535 3.2695 3.1285 1.3562 5.4354 5.5466 3.2141 3.9792 4.0859 5.6596 5.0975 4.3786 3.6387 1.4729 1.3450 4.5925 1.5749 1.3364 1.6418 1.6029 6.4214 3.9578 1.3784 1.3816 1.3867 3.1616 1.8072 1.6890 2.3572 1.6866 1.8044 1.6513 1.4783 1.5503 1.9993 1.1586 2.1118 1.9824 2.9643 2.4221 1.4216 2.4351 4.5740 5.0275 4.0747 3.4696 3.7484 4.3583 3.8998 3.5830 4.3453 6.2106 5.9101 3.5914 3.8582 5.8595 1.5132 1.3791 4.9398 1.0893 1.0887 1.0884 1.0931 1.0943 1.0957 1.0951 1.0760 1.0762 1.0451 1.0452 1.0809 1.1035 1.1035
irintensity: 4.3257 0.1615 7.2782 3.0037 10.9587 2.0773 0.4032 12.1033 2.4957 0.9990 6.2404 7.7818 2.5346 13.5344 5.4400 46.3895 94.1855 106.2085 5.8958 2.6907 104.4230 222.5791 27.2702 19.1978 10.4498 38.4252 10.1489 6.5885 10.0343 79.7879 5.8594 2.5924 12.3684 3.0230 25.8753 4.5923 3.8197 1.5802 3.9892 46.2570 70.3591 15.3972 75.5134 12.1192 86.5658 37.4859 4.0855 5.7364 0.2214 2.7835 6.7205 11.6319 6.1025 4.6631 69.2550 101.2450 64.4781 82.3107 10.1583 3.0225 41.2570 4.6390 2.9162 21.4314 31.4864 18.4059 5.7128 41.0489 120.0163 38.3285 155.4882 109.9482 40.8706 4.3903 36.0664 42.1969 19.8495 48.7439 57.2131 95.6319 84.1670 10.4033 170.6415 199.7531 30.3547 24.9535 22.2146 18.4461 1.9716 5.3190 11.9346 0.2155 35.2151 29.7835 21.8185 22.4487 31.8758 21.6397 19.7446
temp: 298.150 k
press: 1.00000 atm
elementType: 7 7 7 7 7 7 6 6 6 6 6 6 6 6 6 6 6 6 6 6 6 1 1 1 1 1 1 1 1 1 1 1 1 1 1
symmnumber: 1
zpe: 712791.5 jmol-1
zpe.correction: 0.271488 hartree
zpe.thermalcorrener: 0.289396 hartree
zpe.thermalcorrenthalpy: 0.290340 hartree
zpe.thermalcorrgfe: 0.224494 hartree
zpe.sumelectzpe: -907.065219 hartree
zpe.sumelectthermal: -907.047311 hartree
zpe.sumelectthermalent: -907.046367 hartree
zpe.sumelectthermalfe: -907.112213 hartree
dipole: 0.0203 2.3712 2.5306
dipole: 3.4680
quadrupole: -62.1270 -118.5762 -130.4614
quadrupole: -7.2140 1.0991 -1.3817
quadrupole: 41.5945 -14.8546 -26.7399 -7.2140 1.0991 -1.3817
hfenergy: -907.3367074 hartree
pointgroup: C01 [X(C15H14N6)]
dipole: -0.0061048 -0.9812487 0.9480062 debye
polarizability: 466.7261784|6.577579|206.8632347|-3.502994|3.0657031|84.7612001 unknown
InChI: InChI=1S/C15H14N6/c16-13(17)8-1-3-9(4-2-8)15-20-11-6-5-10(14(18)19)7-12(11)21-15/h1-7,16,18,21H,17,19H2
charge 0 multiplicity 1
35 atoms
N  -0.68811 0.857372 0.015379
N  -0.441045 -1.397988 -0.246421
N  -6.793003 -0.128204 0.388193
N  -5.84831 2.023397 -0.190599
N  6.746759 -0.867288 0.187914
N  6.514103 1.498915 -0.273073
C  -1.989316 0.340785 -0.035916
C  0.210098 -0.21716 -0.114217
C  -1.808776 -1.07869 -0.201547
C  1.669102 -0.06454 -0.105599
C  -3.25399 0.942887 0.04318
C  -4.382709 0.094111 -0.045751
C  -2.944315 -1.914503 -0.303767
C  -4.216681 -1.318174 -0.226075
C  2.477562 -1.221524 -0.268587
C  2.309868 1.196955 0.052799
C  4.519434 0.136611 -0.088216
C  3.880288 -1.12108 -0.260678
C  3.711465 1.293457 0.05934
C  -5.739638 0.728369 0.046763
C  6.010997 0.296442 -0.061383
H  -0.439684 1.838397 0.121178
H  -3.421357 2.018097 0.154886
H  -2.824629 -2.991341 -0.453422
H  -5.098065 -1.955859 -0.35845
H  1.976625 -2.1843 -0.407239
H  1.723298 2.115687 0.17545
H  4.469462 -2.029808 -0.431384
H  4.22072 2.255333 0.169707
H  -7.746182 0.226344 0.424387
H  -6.623527 -1.074346 0.720922
H  -6.815869 2.386619 -0.066411
H  7.764022 -0.839694 0.177651
H  6.298376 -1.727084 0.495074
H  7.552827 1.531208 -0.213285
