program: Gaussian 09
title: 000149434
version: EM64L-G09RevD.01
frameworkgroup: C1[X(C6H9NO)]
method: RPBEPBE
basis: SDD
operation: Freq
keyword: #pfreq=noraman
keyword: PBEPBE/SDD
title: #p freq=noraman PBEPBE/SDD
converged: YES YES NO NO
title: Mulliken charges:
elementType: O N C C C C C C H H H H H H H H H
charge: -0.446350 -0.077724 0.317151 -0.370636 -0.393189 -0.202938 -0.440692 -0.609568 0.261668 0.262722 0.248147 0.187515 0.219512 0.235140 0.234842 0.241593 0.332806
chargesum: 0.00000
title: Mulliken charges with hydrogens summed into heavy atoms:
elementType: O N C C C C C C
charge: -0.113544 -0.077724 0.317151 -0.108968 -0.130467 0.045209 -0.033665 0.102007
polarizability: 9.57043346e+01 1.22944482e+00 7.28470302e+01 -4.32981888e+00 8.59589179e-01 4.71857143e+01
1716.lowfreq: -10.1550 -0.0007 0.0003 0.0005 1.1342 15.5594 53.4281 71.9369 129.1339
frequency: 53.4219 71.8839 129.1311 202.3435 243.2997 326.5147 358.9062 419.7282 594.9594 604.0199 667.2095 698.2713 713.2165 777.0637 849.3859 918.0639 957.5938 983.9689 986.3156 1053.7674 1086.1946 1116.1385 1148.3428 1175.7002 1240.8748 1284.2597 1348.1638 1361.2741 1382.1492 1409.8687 1430.2363 1473.5519 1473.7938 1488.3755 1503.8016 1558.8454 2956.6823 2983.8231 3054.3039 3072.4423 3103.4344 3208.4202 3213.2806 3235.1664 3553.4682
redmass: 3.2306 1.0541 3.8494 3.6470 2.0373 1.3077 3.2955 3.2279 3.5102 3.3379 2.8015 1.5165 2.6778 1.5549 1.3377 6.0276 1.6720 4.3005 2.6123 1.5819 1.2030 1.3191 1.1522 1.5741 1.3774 1.2425 2.8534 3.8620 1.6766 4.0926 1.3442 1.0844 1.0632 1.1053 2.7383 5.1735 1.0686 1.0366 1.0945 1.0982 1.1013 1.0903 1.0979 1.1075 1.0661
irintensity: 0.9246 0.0178 1.2687 7.4416 12.8808 147.0698 3.5519 10.7809 4.2132 10.9789 9.1873 4.6958 48.4132 76.6045 4.2457 99.5426 2.7480 6.7716 4.0767 1.6273 16.1152 11.3593 11.8992 74.4199 3.0161 14.4600 44.9937 1.2983 18.0065 2.0990 3.1985 13.8653 7.7002 11.6986 29.8140 11.4192 78.4520 72.9047 29.2764 26.2066 14.8506 0.6449 1.1490 2.5983 3.3267
temp: 298.150 k
press: 1.00000 atm
elementType: 8 7 6 6 6 6 6 6 1 1 1 1 1 1 1 1 1
symmnumber: 1
zpe: 367682.2 jmol-1
zpe.correction: 0.140043 hartree
zpe.thermalcorrener: 0.148456 hartree
zpe.thermalcorrenthalpy: 0.149400 hartree
zpe.thermalcorrgfe: 0.106426 hartree
zpe.sumelectzpe: -363.372536 hartree
zpe.sumelectthermal: -363.364123 hartree
zpe.sumelectthermalent: -363.363178 hartree
zpe.sumelectthermalfe: -363.406152 hartree
dipole: -4.4796 -1.3160 0.4975
dipole: 4.6953
quadrupole: -50.1017 -44.0089 -48.2039
quadrupole: -0.3205 -1.8301 -0.2468
quadrupole: -2.6635 3.4293 -0.7658 -0.3205 -1.8301 -0.2468
hfenergy: -363.5125787 hartree
pointgroup: C01 [X(C6H9N1O1)]
dipole: 1.7334821 0.6347945 0.0669885 debye
dipolederiv: -0.7662679 0.1450473 0.2110558 0.1893767 -0.4456162 0.1173273 0.3379289 0.1141571 -0.5254113 -0.8647661 -0.2746002 -0.0278595 -0.1844388 -0.1598794 -0.0478993 0.0598677 0.0100072 -0.1086913 -0.2673015 -0.006813 0.0692527 -0.0582835 0.0169028 -0.0336064 0.0057911 -0.0294764 -0.1685588 0.4083335 0.0949726 0.0493831 -0.0302149 -0.1947974 -0.0270328 0.1087055 -0.026573 -0.2020711 -0.1731855 -0.0524068 -0.0020419 -0.0319853 -0.0193899 -0.0482228 -0.0271346 -0.0579039 -0.2382041 0.0578783 0.1705878 0.0169292 0.2882866 0.0913972 -0.0317042 -0.0508717 -0.0683285 -0.205525 0.6980888 -0.0294934 -0.1262681 -0.0951871 0.3608567 -0.0615444 -0.1645216 -0.0641682 0.5812202 0.5645267 0.1769312 0.0530524 0.1827485 0.2233546 0.0565034 -0.0158842 0.0348691 0.2385998 0.0869932 -0.0265628 -0.0088956 -0.0128961 -0.0204708 0.0642976 -0.0135976 0.0696292 0.1914475 0.0768884 -0.0765337 0.0012273 -0.05839 -0.0027191 0.0435348 -0.0009089 0.0408267 0.1846045 -0.0124802 0.0791583 -0.0526827 0.0451853 0.0654428 0.0510889 -0.0411448 0.0564094 0.1940118 0.0049516 -0.0211881 0.0464308 0.0477034 -0.1799174 0.1486012 0.0164444 0.0839031 -0.0206889 -0.0599912 -0.0337419 -0.0639937 -0.0849837 0.0115863 -0.1198615 -0.0258164 -0.0583804 -0.050863 -0.0571683 0.0369743 0.017685 0.1453896 -0.0174166 -0.0409513 0.0157941 -0.0303189 0.1052022 0.0578545 0.0007102 -0.0295832 -0.0895606 -0.0228515 0.1049806 0.0399691 0.1196056 -0.0017034 -0.0396434 -0.0563973 -0.0162547 -0.1033084 0.033353 -0.0815512 -0.1163851 -0.1176582 -0.1070692 0.2852892 -0.1266447 -0.137437 -0.1494419 0.2601649 -0.0939601 -0.1282359 -0.0766001 0.1336999 unknown
polarizability: 95.3791992|3.5168425|71.0434509|4.4591781|-6.8452635|49.3144291 unknown
InChI: InChI=1S/C6H9NO/c1-7-3-2-6(4-7)5-8/h2-4,8H,5H2,1H3
charge 0 multiplicity 1
17 atoms
O  -3.06337 0.108957 0.561239
N  1.524298 0.223648 -0.014477
C  -0.722597 0.006383 -0.288555
C  0.357297 0.901421 -0.37176
C  -0.183273 -1.259567 0.149709
C  1.196544 -1.09708 0.313353
C  -2.159578 0.325111 -0.595488
C  2.86066 0.819596 0.08676
H  0.379171 1.949511 -0.667475
H  -0.74878 -2.174618 0.318621
H  1.962927 -1.803616 0.627579
H  -2.245822 1.370509 -0.96143
H  -2.574232 -0.345627 -1.36786
H  3.627315 0.05094 -0.107231
H  2.974078 1.616103 -0.667659
H  3.038875 1.252515 1.088886
H  -2.618313 0.479014 1.366088
