program: Gaussian 09
title: 000149430
version: EM64L-G09RevD.01
frameworkgroup: C1[X(C8H5N3O2S)]
method: RPBEPBE
basis: SDD
operation: Freq
keyword: #p
keyword: freq=noraman
keyword: PBEPBE/SDD
title: #p freq=noraman PBEPBE/SDD
converged: NO YES NO NO
title: Mulliken charges:
elementType: S O O N N N C C C C C C C C H H H H H
charge: 0.445856 -0.165977 -0.207011 -0.059742 0.078732 0.120746 -0.200092 0.237268 -0.314752 -0.266503 -0.224643 -0.181783 -0.163453 -0.351374 0.269383 0.238232 0.248581 0.242233 0.254299
chargesum: 0.00000
title: Mulliken charges with hydrogens summed into heavy atoms:
elementType: S O O N N N C C C C C C C C
charge: 0.445856 -0.165977 -0.207011 -0.059742 0.078732 0.120746 -0.200092 0.237268 -0.045369 -0.028271 -0.224643 0.066799 0.078780 -0.097075
polarizability: 2.63501033e+02 -4.55469002e+00 1.35453930e+02 -2.05093666e-02 6.30431933e-03 4.81898975e+01
1716.lowfreq: -11.2534 -0.0030 -0.0030 -0.0027 5.6557 6.7818 45.7943 54.5255 75.6903
frequency: 45.3301 54.5126 75.6796 92.3701 154.1554 199.6697 256.6323 286.1254 386.1178 400.3421 403.7585 441.3279 490.9403 545.9425 601.7292 610.2691 627.2131 674.7879 683.4114 700.8306 740.9734 744.8265 792.7560 851.9543 898.3807 950.6222 966.0955 968.3012 1002.9883 1022.7731 1042.1896 1089.3420 1157.8122 1172.1039 1222.8459 1236.1099 1291.4237 1305.4146 1321.1561 1376.3823 1412.4531 1416.0119 1441.2705 1514.7190 1562.0043 1577.1103 3142.0378 3148.5652 3163.7645 3180.3912 3200.2598
redmass: 7.1773 7.1696 9.9382 7.6386 6.8894 10.3752 9.6003 5.8179 9.5793 3.3835 14.0248 4.8034 9.9583 5.4803 3.2395 7.6206 12.3211 13.5921 7.2453 8.7727 1.8490 12.3342 2.0396 1.5454 1.3180 7.1027 1.4408 7.7533 1.3517 8.2621 2.2642 1.6892 4.8658 1.1182 5.3024 2.1351 1.6505 2.3869 9.0856 14.4085 2.2833 4.5079 2.4892 6.2428 5.4340 5.6190 1.0878 1.0901 1.0952 1.1015 1.0952
irintensity: 0.5771 0.1704 0.4556 0.3088 3.4770 4.1251 0.5769 0.0148 1.6261 5.6446 1.7973 1.9003 0.3557 7.8740 1.7698 3.5265 0.7203 5.1023 4.6491 2.3019 25.5078 52.5303 67.4192 16.9537 0.4152 2.4482 1.4465 0.6922 0.0515 24.6661 1.3262 3.4963 214.4319 11.2994 116.1060 138.6255 0.8567 1.5244 3.2205 142.2857 20.8240 120.6323 12.4130 12.2323 9.5300 16.8857 11.4581 3.3636 16.2637 19.1202 6.1249
temp: 298.150 k
press: 1.00000 atm
elementType: 16 8 8 7 7 7 6 6 6 6 6 6 6 6 1 1 1 1 1
symmnumber: 1
zpe: 320863.5 jmol-1
zpe.correction: 0.122210 hartree
zpe.thermalcorrener: 0.133593 hartree
zpe.thermalcorrenthalpy: 0.134537 hartree
zpe.thermalcorrgfe: 0.083085 hartree
zpe.sumelectzpe: -1019.521020 hartree
zpe.sumelectthermal: -1019.509638 hartree
zpe.sumelectthermalent: -1019.508693 hartree
zpe.sumelectthermalfe: -1019.560146 hartree
dipole: 9.1521 1.7418 -0.0086
dipole: 9.3163
quadrupole: -89.6035 -85.7105 -88.0176
quadrupole: 3.2592 0.0224 -0.0360
quadrupole: -1.8263 2.0667 -0.2404 3.2592 0.0224 -0.0360
hfenergy: -1019.6432309 hartree
pointgroup: C01 [X(C8H5N3O2S1)]
dipole: -3.5854942 0.7508012 -0.1230949 debye
dipolederiv: 0.2832535 -0.049451 0.0059463 -0.0009127 -0.1255717 0.0337954 0.0007403 0.0332118 0.2220339 -1.043213 -0.1896837 0.0063655 -0.2324424 -0.4606928 0.0233112 0.0112485 0.0241334 -0.1915602 -0.6720004 0.1030875 -0.0164435 0.3186451 -0.6997035 0.0517726 -0.0363606 0.0478234 -0.2284412 -0.3846452 -0.0570896 0.0024337 -0.0381071 -0.3176916 0.0087267 0.0002385 0.0081524 -0.215627 0.1517555 -0.0188519 0.0055591 -0.4128624 -0.4858942 0.0285131 0.0441508 0.0338631 -0.1267707 2.2374291 -0.0482653 0.0338594 -0.4397539 1.0109225 -0.0869307 0.0693321 -0.0802785 0.2062459 0.401939 -0.1360918 0.0214422 0.2243158 0.0824122 -0.0145285 -0.0126946 -0.0193278 -0.0967183 0.455552 0.117062 -0.0052175 -0.0106877 0.0557353 0.0030767 0.0066347 0.0048361 0.0880579 -0.491227 0.0092564 -0.0064546 -0.3811806 0.1632771 -0.0299619 0.0292831 -0.0242966 -0.086458 -0.411209 0.0119608 -0.0057421 0.076886 0.0497185 -0.0119988 -0.0113098 -0.0131602 -0.0987404 -0.8156307 0.2761682 -0.0393434 0.7974508 0.395657 -0.0257674 -0.0875618 -0.0335619 0.0001548 0.2781321 -0.0664031 0.0121546 -0.0492038 0.1414096 -0.0231782 0.0104714 -0.0234033 -0.1041069 0.0284736 0.1015681 -0.007203 -0.2403352 -0.2282592 0.0074022 0.0230471 0.0129624 -0.1038812 -0.1287156 -0.0171388 0.0005383 0.3852101 0.4014787 -0.0350768 -0.035739 -0.041217 -0.0505882 0.0701878 0.0566809 -0.0071449 0.0959122 0.0271786 0.0163719 -0.0111418 0.015891 0.180732 0.0907364 -0.0816406 0.0062865 -0.0590424 -0.0452395 0.0171711 0.0042547 0.0168516 0.1551673 -0.0039078 0.081725 -0.0098579 0.105303 0.0046435 0.014873 -0.0119246 0.0144424 0.1493819 -0.0873848 -0.0485737 0.0004325 -0.0386026 0.0949042 0.0058146 -0.0002091 0.0057241 0.1653277 0.0404746 -0.0443194 0.0023887 -0.1005924 -0.0642846 0.0166139 0.0075403 0.0173535 0.1357907 unknown
polarizability: 263.5821828|2.2269852|134.568453|3.1468429|-8.0599348|48.9942242 unknown
InChI: InChI=1S/C8H5N3O2S/c12-11(13)8-10-5-7(14-8)6-3-1-2-4-9-6/h1-5H
charge 0 multiplicity 1
19 atoms
S  0.953334 -1.091117 0.135958
O  4.648793 0.485101 0.034735
O  3.835585 -1.651464 0.232708
N  -1.995946 -1.186119 0.090848
N  1.977824 1.388746 -0.085337
N  3.693141 -0.367955 0.10568
C  -0.143836 0.336337 -0.01839
C  -1.591367 0.124278 -0.021759
C  0.597439 1.521761 -0.118851
C  -2.518812 1.195973 -0.133632
C  2.311509 0.116042 0.03993
C  -3.897885 0.902752 -0.129379
C  -4.318088 -0.442425 -0.01448
C  -3.32896 -1.449544 0.093091
H  0.175774 2.522169 -0.221293
H  -2.172895 2.230286 -0.220959
H  -4.63246 1.709876 -0.213916
H  -5.379189 -0.70769 -0.00691
H  -3.606463 -2.505206 0.183857
