program: Gaussian 09
title: 000149490
version: EM64L-G09RevD.01
frameworkgroup: C1[X(C20H16ClN3O2S)]
method: RPBEPBE
basis: SDD
operation: Freq
keyword: #p
keyword: freq=noraman
keyword: PBEPBE/SDD
title: #p freq=noraman PBEPBE/SDD
converged: YES YES NO NO
title: Mulliken charges:
elementType: Cl S O O N N N C C C C C C C C C C C C C C C C C C C C H H H H H H H H H H H H H H H H
charge: -0.056494 0.981547 -0.532570 -0.537497 -0.505962 -0.027748 -0.473137 0.220144 0.247799 0.236286 -0.096051 -0.111539 0.485047 -0.388557 -0.337515 -0.303897 -0.304822 0.342896 -0.335649 -0.477274 -0.255215 -0.258039 -0.282234 -0.234831 -0.232307 -0.235375 -0.761920 0.314522 0.229392 0.266459 0.269216 0.268657 0.300243 0.239417 0.284274 0.233017 0.235435 0.236880 0.236841 0.278513 0.271579 0.294339 0.276131
chargesum: 0.00000
title: Mulliken charges with hydrogens summed into heavy atoms:
elementType: Cl S O O N N N C C C C C C C C C C C C C C C C C C C C
charge: -0.056494 0.981547 -0.532570 -0.537497 -0.191440 -0.027748 -0.194625 0.220144 0.247799 0.236286 -0.096051 -0.111539 0.485047 -0.159165 -0.071055 -0.034681 -0.036165 0.342896 -0.035405 -0.237857 -0.022198 -0.022605 -0.282234 0.049443 0.004573 0.001466 0.080129
polarizability: 5.42706485e+02 -4.42569147e+00 3.52337567e+02 1.66583016e+01 -1.11440299e+00 1.98673151e+02
1716.lowfreq: -0.0020 -0.0014 -0.0013 1.0278 1.3408 7.8127 17.3967 22.4089 26.0342
frequency: 17.3839 22.3784 26.0250 36.1720 49.7996 62.2126 80.9545 108.7744 114.9046 125.3695 134.5991 150.2512 161.0902 182.6676 187.2177 214.8374 240.0712 245.1373 258.0396 288.6780 299.0782 316.1971 323.3845 366.3572 372.4040 395.9128 397.5146 404.8056 434.4891 450.6336 467.0749 473.7551 498.3163 504.0193 513.6843 541.8311 551.9220 579.4196 585.8047 593.9611 616.3639 638.0200 654.3285 666.5047 706.7791 720.0408 747.3269 767.9552 773.3677 786.9841 802.6315 811.3233 819.6911 842.6162 858.6437 862.4827 867.4709 873.3210 877.2338 894.7786 897.0822 931.2027 954.8422 955.8132 965.9676 970.2674 997.1461 997.7766 1010.5477 1017.1197 1018.6051 1021.5166 1079.5452 1110.8404 1134.4316 1151.6882 1162.0117 1183.0618 1194.0918 1223.4134 1241.6191 1250.3932 1272.1688 1284.6189 1288.1730 1294.1484 1296.7162 1345.2349 1366.6229 1372.3776 1394.9874 1407.6649 1416.2562 1425.2684 1431.7133 1441.2999 1455.4879 1466.0143 1479.6871 1485.7424 1525.3360 1544.7716 1549.7500 1562.9056 1610.8963 1612.0197 1631.4815 3031.1317 3126.3735 3133.8003 3136.0018 3141.4018 3149.9782 3157.8220 3166.5229 3173.3735 3175.0855 3180.2440 3180.9535 3185.3604 3187.3160 3340.8816 3519.4451
redmass: 7.6368 5.9552 7.1864 6.7627 6.9250 6.1584 5.3089 4.5493 4.2622 8.5138 5.9297 3.7099 1.2957 5.4916 5.2174 5.6047 4.6597 4.5687 5.9760 4.8362 5.1439 6.0551 6.8040 7.5927 7.7941 6.0390 4.5240 4.4140 4.5518 3.7425 4.0251 2.8330 1.6874 2.6708 5.9019 9.0495 5.5198 4.5004 3.7563 5.3958 5.0915 6.0773 5.7083 6.5401 5.1442 3.8120 3.4477 1.5951 1.3673 3.9083 3.0318 4.9892 1.7750 6.1358 1.8639 2.1870 1.6711 1.5721 1.9196 4.4175 2.4367 6.2237 1.3524 1.3362 1.3584 1.3544 1.3306 1.3278 2.2598 2.8311 2.3110 2.0292 4.3378 2.0242 1.4705 1.3435 1.1807 1.1694 1.2735 1.4262 1.9956 2.8904 1.7084 1.7330 1.1405 3.0114 2.6574 2.8022 2.2782 3.3159 2.9675 1.0579 1.0560 5.6283 5.1671 2.7751 3.0811 2.0797 3.1221 3.9301 6.8958 7.2542 7.5494 3.2640 6.0229 6.4768 6.4029 1.0239 1.0858 1.0907 1.0859 1.0892 1.0892 1.0949 1.0951 1.0997 1.1001 1.0923 1.1074 1.0951 1.1080 1.0744 1.0749
irintensity: 2.1662 2.3114 2.1411 0.4586 0.2961 3.3233 3.0256 4.0206 6.0810 26.4925 6.2443 10.2278 9.1247 16.9563 26.8706 1.9252 1.6473 1.5575 22.6281 8.2398 4.9484 11.6494 26.4029 15.0909 9.3353 4.4840 8.1128 23.0088 12.2103 39.6194 9.5328 19.0942 156.9206 46.7581 15.1826 34.5782 7.9749 11.9283 0.1542 5.7445 27.6584 9.9593 5.6737 3.3952 14.6147 6.0007 3.0688 153.1375 11.8808 8.6787 17.6009 80.7951 70.9440 2.1799 14.5056 35.6091 54.8353 4.2217 1.1848 4.9313 20.9674 4.7328 78.0692 87.6044 0.5643 1.5749 0.1334 0.4360 24.5547 49.1626 3.3132 10.4277 11.3480 0.2237 4.4045 12.2915 0.5830 6.5007 28.2056 0.3310 3.6718 4.3087 3.1161 6.4362 12.3326 1.2737 93.3040 40.0492 3.6441 170.8155 6.9356 8.2947 11.5836 132.2727 72.9062 18.8418 2.3306 35.0715 29.2150 446.6993 37.1001 13.2643 67.8332 53.9358 138.1865 387.8235 7.1298 0.4706 1.5987 11.7746 4.2159 12.8581 7.6007 18.7446 13.6153 33.5894 20.8339 1.1912 0.0644 1.1464 0.6582 17.9264 43.6509
temp: 298.150 k
press: 1.00000 atm
elementType: 17 16 8 8 7 7 7 6 6 6 6 6 6 6 6 6 6 6 6 6 6 6 6 6 6 6 6 1 1 1 1 1 1 1 1 1 1 1 1 1 1 1 1
symmnumber: 1
zpe: 824113.4 jmol-1
zpe.correction: 0.313888 hartree
zpe.thermalcorrener: 0.338373 hartree
zpe.thermalcorrenthalpy: 0.339317 hartree
zpe.thermalcorrgfe: 0.257254 hartree
zpe.sumelectzpe: -1942.514175 hartree
zpe.sumelectthermal: -1942.489690 hartree
zpe.sumelectthermalent: -1942.488746 hartree
zpe.sumelectthermalfe: -1942.570808 hartree
dipole: 5.7552 -1.2643 1.0939
dipole: 5.9931
quadrupole: -223.8525 -153.3240 -165.6591
quadrupole: -6.3652 -16.5337 -2.8292
quadrupole: -42.9073 27.6212 15.2861 -6.3652 -16.5337 -2.8292
hfenergy: -1942.8280628 hartree
pointgroup: C01[X(C20H16Cl1N3O2S1)]
dipole: 2.166925 -0.9079903 0.1989796 debye
polarizability: 537.3286116|-35.1027752|347.2900121|8.8870246|39.1330618|209.0985787 unknown
InChI: InChI=1S/C20H16ClN3O2S/c1-27(25,26)24-19-11-10-13(12-16(19)21)22-20-14-6-2-4-8-17(14)23-18-9-5-3-7-15(18)20/h2-12,22,24H,1H3
charge 0 multiplicity 1
43 atoms
Cl -2.522405 1.617262 2.425547
S  -6.007135 0.206983 0.250174
O  -7.404967 0.941758 0.629878
O  -5.851726 -0.712324 -1.08382
N  0.531277 -0.33102 -1.377678
N  4.29003 -0.454995 0.726726
N  -4.586957 1.691351 0.04569
C  1.752249 -0.347447 -0.647806
C  2.437781 -1.593808 -0.488263
C  2.345931 0.851243 -0.13962
C  3.730273 -1.584639 0.190716
C  3.615034 0.728323 0.576305
C  -0.713888 0.180991 -0.975007
C  1.90878 -2.852387 -0.94372
C  1.795016 2.165868 -0.338685
C  4.453363 -2.821309 0.329219
C  4.221831 1.912182 1.127462
C  -3.309839 1.176749 -0.233562
C  -0.952418 0.627427 0.358142
C  -1.78248 0.219536 -1.921484
C  2.635424 -4.030646 -0.786264
C  2.423206 3.289164 0.191875
C  -2.227789 1.086236 0.696733
C  -3.041604 0.708539 -1.558912
C  3.92619 -4.014059 -0.15522
C  3.638644 3.16166 0.948547
C  -5.500217 -0.910727 1.7433
H  0.517859 -0.890784 -2.233537
H  0.908664 -2.894108 -1.389783
H  0.877906 2.283199 -0.922341
H  5.42344 -2.7755 0.833126
H  5.160621 1.779303 1.673391
H  -0.160859 0.591462 1.109723
H  -1.608942 -0.120538 -2.949005
H  -3.859541 0.757099 -2.282519
H  2.216271 -4.981741 -1.132033
H  1.992539 4.282544 0.026486
H  4.484488 -4.94978 -0.044315
H  4.110516 4.056742 1.367797
H  -4.641023 2.160185 0.973389
H  -5.604286 -0.291202 2.644055
H  -6.204819 -1.753878 1.724487
H  -4.46454 -1.226511 1.558107
