program: Gaussian 09
title: 000149421
version: EM64L-G09RevD.01
frameworkgroup: C1[X(C19H14O)]
method: RPBEPBE
basis: SDD
operation: Freq
keyword: #pfreq=noraman
keyword: PBEPBE/SDD
title: #p freq=noraman PBEPBE/SDD
converged: NO NO NO NO
title: Mulliken charges:
elementType: O C C C C C C C C C C C C C C C C C C C H H H H H H H H H H H H H H
charge: -0.443012 0.118470 0.266240 0.287607 0.136456 0.425327 0.476531 0.169888 -0.795543 -0.416385 -0.476126 -0.377401 -0.335104 -0.906253 0.129844 -0.459672 -0.262544 -0.440530 -0.264698 -0.252516 0.229697 0.221401 0.276951 0.246887 0.219937 0.235180 0.235132 0.247900 0.244038 0.222498 0.222146 0.226332 0.229126 0.362195
chargesum: 0.00000
title: Mulliken charges with hydrogens summed into heavy atoms:
elementType: O C C C C C C C C C C C C C C C C C C C
charge: -0.080817 0.118470 0.266240 0.287607 0.136456 0.425327 0.476531 0.169888 -0.565846 -0.194983 -0.199175 -0.130514 -0.115167 -0.188041 0.129844 -0.215633 -0.040046 -0.218383 -0.038366 -0.023390
polarizability: 3.88293246e+02 -1.44889676e+01 2.31482733e+02 -4.78241885e-03 -2.70956585e-03 8.32042664e+01
1716.lowfreq: -32.4092 -2.9192 -0.0011 -0.0007 -0.0006 8.2378 13.6738 56.9633 80.4346
frequency: -32.3837 56.9544 80.4339 148.2574 173.6932 174.3232 240.0138 280.9278 284.6141 294.2360 307.9668 322.7210 363.5395 373.5455 427.8236 436.4767 455.3493 459.3802 491.4940 515.1613 519.9576 544.7491 547.7492 578.4665 593.3209 612.8146 625.3549 644.6147 696.4217 710.5735 745.0284 756.7355 780.6347 819.4991 835.5791 844.8857 853.2833 860.3708 870.6718 874.7397 893.8636 922.1755 957.4733 958.3083 986.8904 992.4556 1003.3450 1032.6550 1049.2826 1054.1284 1062.2159 1093.8610 1125.3723 1154.1642 1176.2371 1184.2453 1208.9991 1229.0975 1250.1239 1253.8140 1269.2717 1277.3318 1298.4842 1325.6307 1363.0223 1389.8608 1400.8165 1405.8200 1418.2821 1433.8111 1436.3757 1446.4262 1481.2508 1490.1089 1501.4860 1527.1341 1540.5676 1575.6232 1599.2474 1612.3931 1627.0671 1628.9020 2973.5900 3059.1273 3072.3511 3115.1446 3116.1790 3120.0286 3132.9988 3147.6849 3151.8015 3160.4608 3170.7235 3185.3938 3276.2340 3587.4368
redmass: 3.5786 5.0907 3.5223 4.3618 3.8775 5.4841 3.5958 6.6357 3.8078 5.7929 3.8925 3.1592 1.1099 1.1654 5.5268 3.3943 4.6930 3.2698 5.9069 6.0406 3.1351 3.4488 5.8166 5.4731 3.4139 5.6749 3.3317 5.8396 5.9602 3.1905 1.5860 1.3632 1.6846 5.2826 2.5383 6.7793 1.4119 1.4694 4.6658 1.9531 5.0856 2.2875 1.3378 1.4005 1.3794 1.3354 2.3749 2.7082 2.1835 1.6314 2.7705 2.1230 1.8728 1.3604 1.1176 1.2075 1.9336 1.4146 1.8575 1.9802 2.5048 1.9043 2.3205 3.4896 4.0826 3.0835 1.8166 1.8668 4.3522 2.8068 2.4959 2.4481 2.8576 1.0490 1.2073 3.0935 4.6736 7.6621 5.7204 6.6871 6.5081 6.7438 1.0371 1.0989 1.0976 1.0907 1.0887 1.0865 1.0892 1.0953 1.0942 1.0903 1.0941 1.0959 1.0888 1.0660
irintensity: 0.0795 0.4928 0.5337 1.7556 1.6418 2.7768 12.9312 0.5759 2.9683 5.6413 0.0002 0.4846 125.3404 5.3949 5.6876 2.3103 3.4974 3.7710 3.1720 0.0450 0.5703 0.3132 4.0003 1.6859 4.3757 0.1382 7.3069 5.6198 1.2284 0.2896 15.7093 41.6401 126.3026 15.5109 0.1550 33.2029 22.4103 1.1096 16.0337 2.2180 10.1157 14.9865 0.1607 5.5627 0.0005 0.5227 16.2488 13.9642 34.4674 9.1870 30.3078 12.0007 45.2769 80.2230 13.2066 4.7524 17.1857 25.3253 4.3411 33.9953 6.5770 26.2378 2.7656 5.3253 6.1440 20.9779 7.9810 2.2887 0.8226 21.0721 1.4753 47.3223 18.8567 13.5943 3.7625 3.9564 13.5358 24.3113 19.8581 27.4459 2.1923 16.5600 32.8567 15.4430 27.6274 12.6635 20.1166 9.6438 13.9045 26.6428 30.2356 13.2232 18.3439 18.2954 8.0249 46.5055
temp: 298.150 k
press: 1.00000 atm
elementType: 8 6 6 6 6 6 6 6 6 6 6 6 6 6 6 6 6 6 6 6 1 1 1 1 1 1 1 1 1 1 1 1 1 1
symmnumber: 1
zpe: 706449.5 jmol-1
zpe.correction: 0.269072 hartree
zpe.thermalcorrener: 0.283212 hartree
zpe.thermalcorrenthalpy: 0.284157 hartree
zpe.thermalcorrgfe: 0.229017 hartree
zpe.sumelectzpe: -806.326601 hartree
zpe.sumelectthermal: -806.312461 hartree
zpe.sumelectthermalent: -806.311517 hartree
zpe.sumelectthermalfe: -806.366656 hartree
dipole: -1.5782 0.8406 0.0001
dipole: 1.7881
quadrupole: -86.7451 -102.3996 -124.5461
quadrupole: 0.9087 -0.0011 0.0004
quadrupole: 17.8185 2.1640 -19.9825 0.9087 -0.0011 0.0004
hfenergy: -806.5956733 hartree
pointgroup: C01 [X(C19H14O1)]
dipole: 0.624293 -0.3242526 0.0000501 debye
polarizability: 388.5765859|-12.8615408|231.1993926|0.0047541|0.002759|83.2042664 unknown
InChI: InChI=1S/C19H14O/c1-12-11-13-5-2-3-6-14(13)17-10-9-15-16(19(12)17)7-4-8-18(15)20/h2-11,20H,1H3
charge 0 multiplicity 1
34 atoms
O  4.152818 2.261712 -0.000232
C  0.156155 -0.637078 0.000194
C  -0.6226 0.587386 0.00008
C  1.632588 -0.524947 0.000131
C  -2.085615 0.571266 0.000185
C  -0.58161 -1.908611 -0.000019
C  -2.763588 -0.695849 -0.000263
C  2.238663 0.795169 -0.000216
C  -1.976402 -1.890544 -0.00036
C  0.046883 1.861437 0.000062
C  1.421625 1.971361 -0.000251
C  2.543464 -1.636809 0.000501
C  -2.895252 1.754594 0.000539
C  0.033748 -3.305126 -0.000065
C  3.666883 0.940954 -0.000225
C  -4.193807 -0.753576 -0.000451
C  3.933473 -1.461319 0.000352
C  4.518125 -0.169217 -0.000022
C  -4.293871 1.682468 0.000281
C  -4.955118 0.417911 -0.000189
H  -2.512685 -2.847571 -0.00059
H  -0.543362 2.780199 0.00005
H  1.908233 2.949631 -0.000447
H  2.185036 -2.658944 0.001007
H  -2.433474 2.745391 0.000888
H  0.651605 -3.496148 -0.896633
H  0.651184 -3.496388 0.896747
H  -0.772786 -4.058122 -0.000343
H  -4.684097 -1.734538 -0.000738
H  4.58204 -2.344169 0.0007
H  5.608909 -0.046892 -0.000032
H  -4.883483 2.60605 0.00047
H  -6.049596 0.369318 -0.000302
H  5.141611 2.270001 -0.000311
