program: Gaussian 09
title: 000102864
version: EM64L-G09RevD.01
frameworkgroup: C1[X(C26H24O6)]
method: RPBEPBE
basis: SDD
operation: Freq
keyword: #pfreq=noraman
keyword: PBEPBE/SDD
title: #p freq=noraman PBEPBE/SDD
converged: YES YES NO NO
title: Mulliken charges:
elementType: O O O O O O C C C C C C C C C C C C C C C C C C C C C C C C C C H H H H H H H H H H H H H H H H H H H H H H H H
charge: -0.281449 -0.276380 -0.285869 -0.280679 -0.263530 -0.226144 -0.200575 -0.466101 0.127688 0.484976 0.428265 -0.735435 0.043818 0.385676 0.220250 -0.463820 -0.413643 0.171858 -0.594782 -0.355535 -0.406025 -0.360395 -0.228397 0.391139 -0.361347 -0.371228 -0.354368 0.322284 -0.503792 0.258174 -0.537776 -0.750581 0.258575 0.269009 0.215157 0.243181 0.238172 0.228731 0.231314 0.280353 0.241590 0.266828 0.301714 0.226518 0.253506 0.252429 0.241015 0.267275 0.225409 0.199769 0.221606 0.223452 0.246708 0.251533 0.246051 0.253827
chargesum: 0.00000
title: Mulliken charges with hydrogens summed into heavy atoms:
elementType: O O O O O O C C C C C C C C C C C C C C C C C C C C C C C C C C
charge: -0.281449 -0.276380 -0.285869 -0.280679 -0.263530 -0.226144 0.058000 -0.197092 0.127688 0.484976 0.428265 -0.038925 0.043818 0.385676 0.220250 -0.235089 -0.182329 0.171858 -0.314428 -0.113945 -0.139196 -0.058681 -0.001879 0.391139 -0.107841 -0.118799 -0.113353 0.322284 0.188661 0.258174 0.153990 0.000830
polarizability: 3.94889354e+02 1.24417240e+01 3.29164187e+02 2.26050804e+01 2.03162913e+01 2.13272429e+02
1716.lowfreq: -7.0889 -3.9563 -2.5739 -0.0003 0.0008 0.0008 18.6185 27.2922 30.0515
frequency: 18.5359 27.1241 30.0188 35.8235 44.7626 48.4829 62.5805 70.4456 75.5637 91.6851 103.3181 115.5460 132.3674 144.8066 165.6851 174.2957 179.4141 189.2653 194.0438 201.9019 222.0201 230.6086 244.7455 252.0001 273.3641 287.3725 309.1636 315.4859 342.1037 367.0939 369.2477 377.3885 397.2959 415.5253 446.9853 454.1577 457.2380 479.1864 491.7153 505.1638 528.9011 537.6880 552.7408 554.6237 570.9203 585.4337 601.5657 610.5925 617.8074 631.2862 634.8190 657.9083 677.6014 706.6052 720.1999 728.4619 739.6061 745.5749 772.1974 783.6221 803.1445 815.0543 823.7885 833.7546 842.0620 845.2124 865.8495 881.8479 891.3038 916.3455 927.4306 950.8889 954.4870 957.3919 962.7185 968.7946 978.0588 987.7744 991.9903 998.1835 1010.9066 1031.0663 1039.8597 1055.7450 1069.3287 1094.3765 1109.2858 1112.6156 1112.8306 1116.6106 1136.2707 1146.4035 1153.1848 1157.2823 1164.5862 1168.5391 1175.0152 1179.1903 1190.4859 1213.3867 1214.9937 1231.5208 1232.0153 1253.3199 1264.4619 1274.4966 1284.4668 1300.0349 1323.8058 1332.6325 1376.1459 1378.8789 1383.2257 1387.7024 1395.0097 1417.1418 1420.1460 1429.4640 1436.9873 1445.3218 1452.1716 1453.7539 1454.0722 1462.1641 1468.1484 1472.9730 1473.8779 1474.3105 1478.2854 1482.4351 1502.8309 1580.7977 1585.5558 1595.4148 1596.9107 1624.3501 1625.9421 1658.4239 2961.5909 2975.2383 2990.8510 3008.5458 3011.3405 3021.1001 3050.1473 3083.1916 3089.7705 3095.9556 3096.7537 3125.6928 3126.9836 3129.2091 3131.2175 3141.9328 3144.7389 3149.8131 3154.6247 3168.6388 3172.1403 3179.0454 3181.1668 3217.9935
redmass: 6.9318 4.1369 4.9553 4.0817 4.5324 3.5279 2.0423 1.7180 2.8534 3.6194 4.2154 4.2159 3.6008 3.2636 2.0861 1.5995 2.9217 2.3741 4.4077 2.8159 3.5031 4.1295 1.2968 4.0748 5.4942 4.6022 4.0124 3.7431 5.4802 5.0039 4.7953 6.1148 6.1974 2.9996 5.5528 3.2081 4.4264 4.4021 4.6338 5.5903 3.5193 3.8863 3.7760 4.2245 3.9282 5.7779 6.0342 5.6425 5.2522 6.8403 5.9260 5.7718 4.7550 5.4686 3.2631 6.4826 3.6827 2.9001 5.6027 1.8312 3.5929 1.7335 1.8191 1.7376 2.2588 3.7075 4.7536 1.5666 1.4533 3.9183 3.3313 2.5122 1.6979 1.3190 1.3784 1.3516 4.9114 6.5659 2.6789 1.9635 2.6223 2.7299 1.6391 2.0834 2.4561 2.2755 1.2538 1.2636 1.3434 2.3488 1.9426 1.7124 1.3892 1.3480 3.0711 1.2828 2.5225 1.5138 2.4538 1.5346 1.3861 4.1504 3.2052 2.3620 1.7419 2.3902 2.4258 1.2937 1.5178 1.5940 5.6628 8.0378 1.2666 6.2301 1.2104 4.1022 3.6370 1.3418 1.1718 2.9315 1.0619 1.0469 1.1324 2.0390 1.0498 1.0732 1.0689 1.0627 1.1498 2.3727 2.5635 8.2516 7.6924 7.7334 6.9336 6.8959 7.1061 9.6744 1.0329 1.0365 1.0361 1.0367 1.0840 1.0861 1.1040 1.0991 1.0945 1.0999 1.0974 1.0884 1.0995 1.0904 1.1054 1.0883 1.1011 1.0914 1.0882 1.0960 1.0979 1.0953 1.0925 1.0942
irintensity: 0.2929 0.1378 2.0766 2.7886 0.2485 3.3224 0.7914 1.2454 2.6583 1.0223 2.9027 1.6685 3.1264 2.0241 4.0163 0.1480 0.4700 0.1402 1.5942 2.5034 1.3427 1.1274 0.7850 2.3552 3.4047 3.1731 5.6184 1.1591 1.4683 1.6242 4.8286 1.0332 10.0036 0.2343 1.2141 3.1619 1.2228 3.7254 5.6729 1.5550 7.2532 2.2167 4.9169 13.2523 8.6249 1.8388 21.5033 6.2969 2.9207 6.2253 6.2519 7.7521 11.9421 7.0767 16.1468 8.4411 0.7012 22.9776 2.6853 40.2775 10.5002 43.5477 9.4644 41.1481 43.4241 120.3275 231.1398 38.6410 1.1715 35.7823 9.4620 31.7092 21.2509 1.9601 0.9516 1.0918 149.3546 21.0286 11.8257 228.1262 8.8714 69.8790 8.9700 7.0706 32.3366 319.0095 8.9450 0.1507 0.7948 29.6013 3.7627 25.5995 15.6506 7.0221 127.1256 3.6267 508.8707 80.0758 175.2850 4.3934 2.4503 99.8340 102.9389 128.6321 44.4595 54.2274 8.7973 2.5152 5.4346 27.1510 20.5744 17.8619 46.7357 63.4535 18.3696 7.1715 6.4866 10.3822 9.7691 77.4075 19.1648 18.7032 13.3791 66.8554 13.7351 53.0353 6.3631 28.3705 23.2749 142.8832 101.3056 29.3939 10.4506 23.5997 14.8475 140.0952 32.8944 219.4606 69.8159 72.3648 24.2151 1.6640 14.9543 17.1501 45.7294 21.3920 36.8667 27.7318 6.6118 5.1547 27.5500 10.5072 23.6992 10.4232 12.0546 15.8982 9.7391 8.0474 16.8534 4.1144 0.0907 5.1890
temp: 298.150 k
press: 1.00000 atm
elementType: 8 8 8 8 8 8 6 6 6 6 6 6 6 6 6 6 6 6 6 6 6 6 6 6 6 6 6 6 6 6 6 6 1 1 1 1 1 1 1 1 1 1 1 1 1 1 1 1 1 1 1 1 1 1 1 1
symmnumber: 1
zpe: 1145822.8 jmol-1
zpe.correction: 0.436421 hartree
zpe.thermalcorrener: 0.465690 hartree
zpe.thermalcorrenthalpy: 0.466634 hartree
zpe.thermalcorrgfe: 0.374693 hartree
zpe.sumelectzpe: -1454.202239 hartree
zpe.sumelectthermal: -1454.172970 hartree
zpe.sumelectthermalent: -1454.172026 hartree
zpe.sumelectthermalfe: -1454.263967 hartree
dipole: -2.4584 -3.4596 1.4666
dipole: 4.4904
quadrupole: -182.3433 -162.9089 -182.5895
quadrupole: 5.4823 -3.4436 13.5482
quadrupole: -6.3961 13.0384 -6.6423 5.4823 -3.4436 13.5482
hfenergy: -1454.6386598 hartree
pointgroup: C01 [X(C26H24O6)]
dipole: 1.0714551 1.3052876 0.5188806 debye
polarizability: 395.3490957|6.5334305|326.5381761|-27.6026426|-22.1106845|215.438698 unknown
InChI: InChI=1S/C26H24O6/c1-15-24-20-13-12-19(30-16(2)27)14-23(20)31-26(15,17-8-10-18(28-3)11-9-17)32-25-21(24)6-5-7-22(25)29-4/h5-15,24H,1-4H3
charge 0 multiplicity 1
56 atoms
O  1.004391 -1.311865 -0.546615
O  0.020656 0.860704 -0.273087
O  1.131768 -3.749649 -2.116035
O  -4.40515 2.458166 -0.904497
O  6.289698 2.128557 -0.290672
O  -6.504338 2.035953 0.085788
C  0.665666 -0.423481 1.766471
C  -0.72495 -1.11496 1.756912
C  1.006079 -0.079058 0.287464
C  -0.624197 -2.417882 0.964885
C  -1.752273 -0.178534 1.122252
C  0.730738 0.80813 2.689475
C  0.241784 -2.441813 -0.155633
C  2.375448 0.549669 0.083991
C  -1.32981 0.733211 0.122142
C  -1.390392 -3.559628 1.284722
C  -3.121958 -0.198133 1.458076
C  0.36058 -3.618664 -0.951967
C  -2.23926 1.592406 -0.52015
C  3.53488 -0.254671 0.243744
C  2.534119 1.920376 -0.209666
C  -4.067732 0.646078 0.835999
C  -1.29906 -4.721801 0.488605
C  -3.600751 1.538727 -0.159416
C  -0.426819 -4.746479 -0.618957
C  4.818934 0.298645 0.115837
C  3.819514 2.491934 -0.34628
C  4.966687 1.678147 -0.181143
C  2.465086 -3.12207 -2.19907
C  -5.795014 2.64364 -0.740975
C  6.499423 3.543264 -0.611009
C  -6.262429 3.692928 -1.725523
H  1.422843 -1.159964 2.09862
H  -1.031665 -1.344688 2.793411
H  0.483409 0.511562 3.724953
H  1.741931 1.248902 2.691555
H  0.015792 1.59018 2.380698
H  -2.057936 -3.531613 2.153825
H  -3.466494 -0.895732 2.230863
H  -1.898209 2.285324 -1.292988
H  3.428762 -1.324175 0.454934
H  1.644706 2.541379 -0.343197
H  -5.121228 0.61423 1.110519
H  -1.895615 -5.607258 0.730693
H  -0.33088 -5.632009 -1.25461
H  5.719269 -0.311726 0.233485
H  3.909758 3.556702 -0.580449
H  2.390017 -2.025751 -2.252854
H  2.903516 -3.531424 -3.122314
H  3.088443 -3.41014 -1.330065
H  6.076879 4.200508 0.173709
H  6.056263 3.803178 -1.591877
H  7.591149 3.669041 -0.651925
H  -5.738741 4.646967 -1.540931
H  -7.34723 3.837244 -1.621572
H  -6.021759 3.381219 -2.756452
